{"text_format":"1","workbook":"xlsx","n_sheets":13,"sheets":["Formler","Luleå","Deklinatio","Sammanst","Omslag","Instruktion","Ort","Mot marken","Lutande yta","Diffus stråln","Sparade orter","Indata","Ändringar"],"not_rendered":{"charts":2,"images":0,"macros":1,"external_links":0,"defined_names":16,"comments":5,"pivot_tables":0},"unopened":[],"bounds":{"document_bytes":16777216,"sheet_cells":100000,"rows_first":2000,"rows_last":500,"rows_between":2000,"halvings":0,"cell_chars":16384,"cell_head_chars":4096},"cells_cut":0,"cells_raw":0,"read":"whole","date_system":"1900"}

{"sheet":"Formler","index":0,"n_rows":30,"n_cols":10,"rows_kept":30,"cut":false,"hidden":true,"merged":[[2,1,2,5],[3,1,3,5],[4,1,4,5],[5,1,5,5],[6,1,6,5]]}
[]
["Tillvägagånssätt:"]
["1. ","Hämta månadsvärden för direktstrålning och globalstrålning från SMHI  http://strang.smhi.se/"]
["2. ","Beräkna direktstrålningen  för varje timme vid aktuella solhöjder enligt medel Brown Isfält nedan för ett dygn omkring den 20:e i varje månad. "]
["3. ","Bestäm dygninstrålningens fördelning per timme"]
["4. ","Fördela SMHIs månadsinstrålning på timmar enligt den beräknade fördelningen (hela månadsinstrålningen kommer på ett dygn)"]
["5. ","Gör samma sak för diffusstrålningen, dvs. globalstrålning minus diffusstrålning och bestäm fördelningen enligt Plejels formel nedan"]
[]
["Solens läge"]
[null,"Ex"]
["H",90,"Timvinkel -antal timmar fr S mot V ggr 15"]
["δ",-19.899999999999999,"deklination"]
["φ",65.349999999999994,"latitud"]
[]
["h",{"$f":"ASIN(SIN(B13*PI()/180)*SIN(B12*PI()/180)+COS(B13*PI()/180)*COS(B12*PI()/180)*COS(B11*15*PI()/180))*180/PI()","v":-18.020762313854366},"eq 21"]
["A",{"$f":"ASIN((SIN(B11*15*PI()/180)*COS(B12*PI()/180))/COS(B15*PI()/180))*180/PI()","v":-81.414400073356092},"eq 19"]
[null,null,null,null,null,null,null,"Månad","Dag","Deklination"]
["Formler",null,null,null,null,null,null,"dec",22,-23.45]
["Brown, Isfält",null,null,null,null,null,null,"jan",21,-19.899999999999999]
[null,null,null,null,null,null,null,"feb",20,-10.9]
["IDN","direktstrålning","okt-apr","1071*EXP(-0,109/SIN(h*PI()/180))",null,null,null,"mar",20,0]
["IDN","direktstrålning","maj-sept","1071*EXP(-0,139/SIN(C9*PI()/180))",null,null,null,"apr",19,11.1]
["IDN","direktstrålning","~medel","1071*EXP(-0,129/SIN(C9*PI()/180))",null,null,null,"maj",20,20]
[null,null,null,null,null,null,null,"jun",21,23.45]
["Pleijel",null,null,null,null,null,null,"jul",23,19.899999999999999]
["IdH","diffusstrålning",null,"244*SIN(h*PI()/180)",null,null,null,"aug",23,11.1]
[null,null,null,null,null,null,null,"sep",22,0]
[null,null,null,null,null,null,null,"okt",21,-11]
[null,null,null,null,null,null,null,"nov",20,-19.899999999999999]
[null,null,null,null,null,null,null,"dec",21,-23.45]

{"sheet":"Luleå","index":1,"n_rows":304,"n_cols":28,"rows_kept":304,"cut":false,"hidden":true,"merged":[[0,2,0,3]]}
["Direktstrålning","Ort","Luleå",null,"Latitud",65.349999999999994,"Longitud",22.09]
[null,null,null,null,null,null,null,null,null,"Medel direktstrålning år 2000-2011",null,null,null,null,null,null,null,null,"Medel globalstrålning år 2000-2011"]
["Wh/m2","Direktstrålning vinkelrät mot strålningsriktningen",null,null,null,null,null,null,null,null,"Wh/m2","Standardav","%",null,"Globalstrålning",null,null,null,null,"Wh/m2","Standardav","%"]
[1,2000,1,31,23,null,30729.9,null,null,"Januari",{"$f":"(G4+G16+G28+G40+G52+G64+G76+G88+G100+G112+G124)/11","v":13427.754545454545},{"$f":"STDEV(G4,G16,G28,G40,G52,G64,G76,G88,G100,G112,G124)","v":7997.8038463522835},{"$f":"L4/K4","v":0.59561736992426895},null,"2000 01 31",23,4325.8,null,"Januari",{"$f":"(Q4+Q16+Q28+Q40+Q52+Q64+Q76+Q88+Q100+Q112+Q124)/11","v":3112.8818181818187},{"$f":"STDEV(Q4,Q16,Q28,Q40,Q52,Q64,Q76,Q88,Q100,Q112,Q124)","v":841.48425275602153},{"$f":"U4/T4","v":0.27032322519957347}]
[2,2000,2,29,23,null,44638.2,null,null,"Februari",{"$f":"(G5+G17+G29+G41+G53+G65+G77+G89+G101+G113+G125)/11","v":40916.818181818184},{"$f":"STDEV(G5,G17,G29,G41,G53,G65,G77,G89,G101,G113,G125)","v":7802.4188929867405},{"$f":"L5/K5","v":0.19068977598199038},null,"2000 02 29",23,18343.7,null,"Februari",{"$f":"(Q5+Q17+Q29+Q41+Q53+Q65+Q77+Q89+Q101+Q113+Q125)/11","v":17350.136363636364},{"$f":"STDEV(Q5,Q17,Q29,Q41,Q53,Q65,Q77,Q89,Q101,Q113,Q125)","v":1963.3590971968067},{"$f":"U5/T5","v":0.11316101822183673}]
[3,2000,3,31,23,null,137652.20000000001,null,null,"Mars",{"$f":"(G6+G18+G30+G42+G54+G66+G78+G90+G102+G114+G126)/11","v":97093.400000000009},24360.760625850675,0.25090027361129258,null,"2000 03 31",23,72993.600000000006,null,"Mars",59094.309090909104,7901.4513550934598,0.1337091756659356]
[4,2000,4,30,23,null,123351.7,null,null,"April",131469.91818181818,26795.456795166476,0.20381435666605741,null,"2000 04 30",23,100734.3,null,"April",106810.61818181816,11986.802651067508,0.11222482235486173]
[5,2000,5,31,23,null,195624.6,null,null,"Maj",180616.81818181818,24193.608374891741,0.13394992015935753,null,"2000 05 31",23,167976,null,"Maj",160524.67272727273,14000.990776876539,8.7220179546254925E-2]
[6,2000,6,30,23,null,201917.5,null,null,"Juni",181603.78181818186,33717.408464198721,0.18566468234651592,null,"2000 06 30",23,180413.6,null,"Juni",173202.48181818181,16808.424777463126,9.7044941856593375E-2]
[7,2000,7,31,23,null,165385,null,null,"Juli",179199.46363636365,34559.000453811459,0.19285214225830222,null,"2000 07 31",23,155663,null,"Juli",161557.01818181819,18291.868256895923,0.11322236856532]
[8,2000,8,31,23,null,127283.2,null,null,"Augusti",132035.16363636364,37676.986335036709,0.28535569841684311,null,"2000 08 31",23,118903.1,null,"Augusti",117808.85454545454,16372.450495717769,0.13897470235907214]
[9,2000,9,30,23,null,115650.8,null,null,"September",89387.136363636368,17951.523966854245,0.20082894135712703,null,"2000 09 30",23,75501,null,"September",65753.354545454538,7501.1208892223631,0.11407966849869118]
[10,2000,10,31,23,null,29916.1,null,"Summa 99","Oktober",46067.936363636363,13934.150180278157,0.30246959773255766,null,"2000 10 31",23,19836.5,null,"Oktober",24347.972727272729,3433.898095777135,0.14103425095144559]
[11,2000,11,30,23,null,3218.6,null,{"$f":"SUM(#REF!)","v":{"$error":"#REF!"}},"November",15623.863636363636,7093.8979464428039,0.45404248984432816,null,"2000 11 30",23,2996.6,null,"November",5034.4181818181814,1285.7854376358289,0.25539901358998096]
[12,2000,12,31,23,null,2877.8,"?",null,"December",6541.4181818181823,3202.8544846177988,0.48962692731067192,null,"2000 12 31",23,708.5,null,"December",920.27272727272714,190.98759169594899,0.20753368652133156]
[null,2001,1,31,23,null,5128.6000000000004,null,null,"Summa",{"$f":"SUM(K4:K15)","v":1113983.4727272727},null,null,null,"2001 01 31",23,3704.6,null,"Summa",{"$f":"SUM(T4:T15)","v":895516.99090909085},"stdav","%"]
[null,2001,2,28,23,null,53868.1,null,null,null,null,null,null,null,"2001 02 28",23,21610.9]
[null,2001,3,31,23,null,116266.1,null,null,null,null,null,null,null,"2001 03 31",23,67665.7]
[null,2001,4,30,23,null,138409.70000000001,null,null,null,null,null,null,null,"2001 04 30",23,106064.2]
[null,2001,5,31,23,null,183605.5,null,null,null,null,null,null,null,"2001 05 31",23,169443]
[null,2001,6,30,23,null,172165.5,null,null,null,null,null,null,null,"2001 06 30",23,177036.2]
[null,2001,7,31,23,null,174231.5,null,null,null,null,null,null,null,"2001 07 31",23,168661.6]
[null,2001,8,31,23,null,129328.4,null,null,null,null,null,null,null,"2001 08 31",23,118757.9]
[null,2001,9,30,23,null,64731.3,null,null,null,null,null,null,null,"2001 09 30",23,57954]
[null,2001,10,31,23,null,35258.300000000003,null,null,null,null,null,null,null,"2001 10 31",23,21431.4]
[null,2001,11,30,23,null,28005.1,{"$f":"SUM(G4:G15)","v":1178245.6000000001},"summa 2000",null,null,null,null,null,"2001 11 30",23,7327.8]
[null,2001,12,31,23,null,7162.7,null,null,null,null,null,null,null,"2001 12 31",23,1047.2]
[null,2002,1,31,23,null,19638.7,null,null,null,null,null,null,null,"2002 01 31",23,4138.3999999999996]
[null,2002,2,28,23,null,34689.699999999997,null,null,null,null,null,null,null,"2002 02 28",23,15467]
[null,2002,3,31,23,null,105276.2,null,null,null,null,null,null,null,"2002 03 31",23,60645.2]
[null,2002,4,30,23,null,129750.3,null,null,null,null,null,null,null,"2002 04 30",23,109492.5]
[null,2002,5,31,23,null,220425.60000000001,null,null,null,null,null,null,null,"2002 05 31",23,180869.2]
[null,2002,6,30,23,null,213647.1,null,null,null,null,null,null,null,"2002 06 30",23,188964.1]
[null,2002,7,31,23,null,203166.2,null,null,null,null,null,null,null,"2002 07 31",23,179024.6]
[null,2002,8,31,23,null,199520.4,null,null,null,null,null,null,null,"2002 08 31",23,145409]
[null,2002,9,30,23,null,102796.9,null,null,null,null,null,null,null,"2002 09 30",23,72465.600000000006]
[null,2002,10,31,23,null,41995.3,null,null,null,null,null,null,null,"2002 10 31",23,26995.4]
[null,2002,11,30,23,null,18174.3,{"$f":"SUM(G16:G27)","v":1108160.8},"summa 2001",null,null,null,null,null,"2002 11 30",23,5934.4]
[null,2002,12,31,23,null,9645.7999999999993,null,null,null,null,null,null,null,"2002 12 31",23,1093.0999999999999]
[null,2003,1,31,23,null,17069.7,null,null,null,null,null,null,null,"2003 01 31",23,3687.1]
[null,2003,2,28,23,null,37368.800000000003,null,null,null,null,null,null,null,"2003 02 28",23,17572.7]
[null,2003,3,31,23,null,75240.399999999994,null,null,null,null,null,null,null,"2003 03 31",23,55069.7]
[null,2003,4,30,23,null,167636.20000000001,null,null,null,null,null,null,null,"2003 04 30",23,124601.9]
[null,2003,5,31,23,null,174933.9,null,null,null,null,null,null,null,"2003 05 31",23,161065.5]
[null,2003,6,30,23,null,207268.3,null,null,null,null,null,null,null,"2003 06 30",23,192750.4]
[null,2003,7,31,23,null,233735,null,null,null,null,null,null,null,"2003 07 31",23,184401.5]
[null,2003,8,31,23,null,112285.3,null,null,null,null,null,null,null,"2003 08 31",23,115957.1]
[null,2003,9,30,23,null,116060.6,null,null,null,null,null,null,null,"2003 09 30",23,76699.5]
[null,2003,10,31,23,null,65340.5,null,null,null,null,null,null,null,"2003 10 31",23,28342.799999999999]
[null,2003,11,30,23,null,17234.900000000001,{"$f":"SUM(G28:G39)","v":1298726.5},"summa 2002",null,null,null,null,null,"2003 11 30",23,5148.8999999999996]
[null,2003,12,31,23,null,12479.5,null,null,null,null,null,null,null,"2003 12 31",23,1242.2]
[null,2004,1,31,23,null,7498.1,null,null,null,null,null,null,null,"2004 01 31",23,2539]
[null,2004,2,29,23,null,47924.800000000003,null,null,null,null,null,null,null,"2004 02 29",23,18603.7]
[null,2004,3,31,23,null,78947.7,null,null,null,null,null,null,null,"2004 03 31",23,53541.4]
[null,2004,4,30,23,null,164253.9,null,null,null,null,null,null,null,"2004 04 30",23,121985.1]
[null,2004,5,31,23,null,153317.20000000001,null,null,null,null,null,null,null,"2004 05 31",23,152249.1]
[null,2004,6,30,23,null,176663.6,null,null,null,null,null,null,null,"2004 06 30",23,175990]
[null,2004,7,31,23,null,164813.4,null,null,null,null,null,null,null,"2004 07 31",23,153410.6]
[null,2004,8,31,23,null,128134.5,null,null,null,null,null,null,null,"2004 08 31",23,117365.9]
[null,2004,9,30,23,null,72066.7,null,null,null,null,null,null,null,"2004 09 30",23,55566.5]
[null,2004,10,31,23,null,56130.8,null,null,null,null,null,null,null,"2004 10 31",23,25739.3]
[null,2004,11,30,23,null,23679.4,{"$f":"SUM(G40:G51)","v":1236653.1000000001},"Summa 2003",null,null,null,null,null,"2004 11 30",23,6516.7]
[null,2004,12,31,23,null,10005.1,null,null,null,null,null,null,null,"2004 12 31",23,1110]
[null,2005,1,31,23,null,7985.1,null,null,null,null,null,null,null,"2005 01 31",23,2279.4]
[null,2005,2,28,23,null,47858,null,null,null,null,null,null,null,"2005 02 28",23,17408.400000000001]
[null,2005,3,31,23,null,115499.9,null,null,null,null,null,null,null,"2005 03 31",23,63980.9]
[null,2005,4,30,23,null,160983.70000000001,null,null,null,null,null,null,null,"2005 04 30",23,115525.2]
[null,2005,5,31,23,null,165397.9,null,null,null,null,null,null,null,"2005 05 31",23,155514.79999999999]
[null,2005,6,30,23,null,108566.2,null,null,null,null,null,null,null,"2005 06 30",23,144112.4]
[null,2005,7,31,23,null,181683.9,null,null,null,null,null,null,null,"2005 07 31",23,169296.9]
[null,2005,8,31,23,null,105775.4,null,null,null,null,null,null,null,"2005 08 31",23,114646.9]
[null,2005,9,30,23,null,103668,null,null,null,null,null,null,null,"2005 09 30",23,72127.199999999997]
[null,2005,10,31,23,null,46792,null,null,null,null,null,null,null,"2005 10 31",23,26408.400000000001]
[null,2005,11,30,23,null,13540.5,{"$f":"SUM(G52:G63)","v":1083435.2},"Summa 2004",null,null,null,null,null,"2005 11 30",23,4156.5]
[null,2005,12,31,23,null,4183.7,null,null,null,null,null,null,null,"2005 12 31",23,760.9]
[null,2006,1,31,23,null,12044,null,null,null,null,null,null,null,"2006 01 31",23,2895.1]
[null,2006,2,28,23,null,44412.2,null,null,null,null,null,null,null,"2006 02 28",23,18133.8]
[null,2006,3,31,23,null,110268.3,null,null,null,null,null,null,null,"2006 03 31",23,63558.1]
[null,2006,4,30,23,null,96390.3,null,null,null,null,null,null,null,"2006 04 30",23,89002.9]
[null,2006,5,31,23,null,176732.5,null,null,null,null,null,null,null,"2006 05 31",23,161877.4]
[null,2006,6,30,23,null,201138.6,null,null,null,null,null,null,null,"2006 06 30",23,178910.3]
[null,2006,7,31,23,null,239802.6,null,null,null,null,null,null,null,"2006 07 31",23,188727.8]
[null,2006,8,31,23,null,200527,null,null,null,null,null,null,null,"2006 08 31",23,142603.20000000001]
[null,2006,9,30,23,null,73689.600000000006,null,null,null,null,null,null,null,"2006 09 30",23,58062]
[null,2006,10,31,23,null,34831.4,null,null,null,null,null,null,null,"2006 10 31",23,18963.900000000001]
[null,2006,11,30,23,null,13208.3,{"$f":"SUM(G64:G75)","v":1061934.3},"Summa 2005",null,null,null,null,null,"2006 11 30",23,4678.3]
[null,2006,12,31,23,null,7974.3,null,null,null,null,null,null,null,"2006 12 31",23,963.9]
[null,2007,1,31,23,null,20723.2,null,null,null,null,null,null,null,"2007 01 31",23,3713.6]
[null,2007,2,28,23,null,29505.9,null,null,null,null,null,null,null,"2007 02 28",23,14328.6]
[null,2007,3,31,23,null,114337.7,null,null,null,null,null,null,null,"2007 03 31",23,59915.5]
[null,2007,4,30,23,null,139236,null,null,null,null,null,null,null,"2007 04 30",23,112582.1]
[null,2007,5,31,23,null,139104.29999999999,null,null,null,null,null,null,null,"2007 05 31",23,134467.79999999999]
[null,2007,6,30,23,null,216726.1,null,null,null,null,null,null,null,"2007 06 30",23,184131.20000000001]
[null,2007,7,31,23,null,160364.70000000001,null,null,null,null,null,null,null,"2007 07 31",23,144184.79999999999]
[null,2007,8,31,23,null,118611.8,null,null,null,null,null,null,null,"2007 08 31",23,109525.2]
[null,2007,9,30,23,null,79398,null,null,null,null,null,null,null,"2007 09 30",23,60689.3]
[null,2007,10,31,23,null,53734.3,null,null,null,null,null,null,null,"2007 10 31",23,24658.9]
[null,2007,11,30,23,null,11664.5,{"$f":"SUM(G76:G87)","v":1211019.1000000001},"Summa 2006",null,null,null,null,null,"2007 11 30",23,4606.3]
[null,2007,12,31,23,null,5822.2,null,null,null,null,null,null,null,"2007 12 31",23,856.2]
[null,2008,1,31,23,null,13941.5,null,null,null,null,null,null,null,"2008 01 31",23,2905.4]
[null,2008,2,29,23,null,31825.3,null,null,null,null,null,null,null,"2008 02 29",23,15379.6]
[null,2008,3,31,23,null,57968.4,null,null,null,null,null,null,null,"2008 03 31",23,44475.6]
[null,2008,4,30,23,null,93499.5,null,null,null,null,null,null,null,"2008 04 30",23,94838.5]
[null,2008,5,31,23,null,209531.4,null,null,null,null,null,null,null,"2008 05 31",23,174279.3]
[null,2008,6,30,23,null,164583.6,null,null,null,null,null,null,null,"2008 06 30",23,165313.29999999999]
[null,2008,7,31,23,null,175324.2,null,null,null,null,null,null,null,"2008 07 31",23,160905.5]
[null,2008,8,31,23,null,99358.6,null,null,null,null,null,null,null,"2008 08 31",23,105144]
[null,2008,9,30,23,null,75990.8,null,null,null,null,null,null,null,"2008 09 30",23,64118.2]
[null,2008,10,31,23,null,51296.3,null,null,null,null,null,null,null,"2008 10 31",23,25817.5]
[null,2008,11,30,23,null,20755.2,{"$f":"SUM(G88:G99)","v":1089228.7},"summa 2007",null,null,null,null,null,"2008 11 30",23,5807.9]
[null,2008,12,31,23,null,3039.9,null,null,null,null,null,null,null,"2008 12 31",23,657.6]
[null,2009,1,31,23,null,7625,null,null,null,null,null,null,null,"2009 01 31",23,2173.4]
[null,2009,2,28,23,null,43797.1,null,null,null,null,null,null,null,"2009 02 28",23,17429.400000000001]
[null,2009,3,31,23,null,78087.899999999994,null,null,null,null,null,null,null,"2009 03 31",23,54293.8]
[null,2009,4,30,23,null,133906.5,null,null,null,null,null,null,null,"2009 04 30",23,109639.9]
[null,2009,5,31,23,null,198670,null,null,null,null,null,null,null,"2009 05 31",23,167481.29999999999]
[null,2009,6,30,23,null,195040.5,null,null,null,null,null,null,null,"2009 06 30",23,176761.60000000001]
[null,2009,7,31,23,null,125155.8,null,null,null,null,null,null,null,"2009 07 31",23,137802.4]
[null,2009,8,31,23,null,147789.5,null,null,null,null,null,null,null,"2009 08 31",23,122046.2]
[null,2009,9,30,23,null,88207.3,null,null,null,null,null,null,null,"2009 09 30",23,67183.899999999994]
[null,2009,10,31,23,null,66480.3,null,null,null,null,null,null,null,"2009 10 31",23,28573.4]
[null,2009,11,30,23,null,7281.2,{"$f":"SUM(G100:G111)","v":997114.7},"summa 2008",null,null,null,null,null,"2009 11 30",23,3517.7]
[null,2009,12,31,23,null,3341.6,null,null,null,null,null,null,null,"2009 12 31",23,737.9]
[1,2010,1,31,23,null,5321.5,null,null,null,null,null,null,null,"2010 01 31",23,1879.9]
[2,2010,2,28,23,null,34196.9,null,null,null,null,null,null,null,"2010 02 28",23,16573.7]
[3,2010,3,31,23,null,78482.600000000006,null,null,null,null,null,null,null,"2010 03 31",23,53897.9]
[4,2010,4,30,23,null,98751.3,null,null,null,null,null,null,null,"2010 04 30",23,90450.2]
[5,2010,5,31,23,null,169442.1,null,null,null,null,null,null,null,"2010 05 31",23,140548]
[6,2010,6,30,23,null,139924.6,null,null,null,null,null,null,null,"2010 06 30",23,140844.20000000001]
[7,2010,7,31,23,null,147531.79999999999,null,null,null,null,null,null,null,"2010 07 31",23,135048.5]
[8,2010,8,31,23,null,83772.7,null,null,null,null,null,null,null,"2010 08 31",23,85538.9]
[9,2010,9,30,23,null,90998.5,null,null,null,null,null,null,null,"2010 09 30",23,62919.7]
[10,2010,10,31,23,null,24972,null,null,null,null,null,null,null,"2010 10 31",23,21060.2]
[11,2010,11,30,23,null,15100.5,{"$f":"SUM(G112:G123)","v":1095382.7000000002},"summa 2009",null,null,null,null,null,"2010 11 30",23,4687.5]
[12,2010,12,31,23,null,5423,null,null,null,null,null,null,null,"2010 12 31",23,945.5]
[null,2011,1,31,23,null,8254.9,{"$f":"SUM(G124:G135)","v":893917.5},"summa 2010"]
[null,2011,2,28,23,null,34791]
[null,null,null,null,null,null,"Medel ",{"$f":"AVERAGE(H26:H137)","v":1113983.4727272727},null,null,null,null,null,null,20,null,{"$f":"IF(O138>6,IF(O138<18,1,-1),-1)","v":-1}]
[null,null,null,null,null,null,"Stadardav",{"$f":"STDEV(H26:H137)","v":113774.20811364142},null,null,null,null,null,null,5,null,{"$f":"IF(O139<=6,,IF(O139<=18,180,-360))","v":0}]
[]
["Solhöjd","h","ARCSIN(SIN(C154*PI()/180)*SIN(C155*PI()/180)+COS(C154*PI()/180)*COS(C155*PI()/180)*COS((B156+12)*15*PI()/180))*180/PI()"]
[null,"A","ARCSIN((SIN((b156+12)*15*PI()/180)*COS(C156*PI()/180))/COS(b158*PI()/180))*180/PI()"]
[null,"IDN","1071*EXP(-0,129/SIN(b158*PI()/180))"]
[null,"IdH","244*SIN(K148*PI()/180)"]
[null,"Lat",65.349999999999994]
["Januari","dekl",-19.899999999999999,null,null,null,null,"180+",null,null,null,null,null,null,null,null,null,null,null,"360-"]
["Kl",1,2,3,4,5,6,7,8,9,10,11,12,13,14,15,16,17,18,19,20,21,22,23,24]
["solhöjd",{"$f":"ASIN(SIN($C$145*PI()/180)*SIN($C146*PI()/180)+COS($C$145*PI()/180)*COS($C146*PI()/180)*COS((B147+12)*15*PI()/180))*180/PI()","v":-43.485309064729677},{"$f":"ASIN(SIN($C145*PI()/180)*SIN($C146*PI()/180)+COS($C145*PI()/180)*COS($C146*PI()/180)*COS((C147+12)*15*PI()/180))*180/PI()","v":-40.465543084494513},-35.920882040456689,-30.360997672174953,-24.259035180587468,-18.020762313854387,-11.997006842981127,-6.5042377559299327,-1.8369694311894287,1.7344600145682418,3.9821303036876587,4.7500000000000062,3.9821303036876587,1.7344600145682576,-1.8369694311894067,-6.5042377559299416,-11.997006842981136,-18.02076231385438,-24.25903518058746,-30.360997672174921,-35.920882040456696,-40.46554308449452,-43.485309064729677,-44.550000000000004]
["azimut",{"$f":"(ASIN((SIN((B147+12)*15*PI()/180)*COS($C146*PI()/180))/COS(B148*PI()/180)))*180/PI()","v":-19.598097612486537},{"$f":"(ASIN((SIN((C147+12)*15*PI()/180)*COS($C146*PI()/180))/COS(C148*PI()/180)))*180/PI()","v":-38.167537823852108},-55.186934613298192,{"$f":"(ASIN((SIN((E147+12)*15*PI()/180)*COS($C146*PI()/180))/COS(E148*PI()/180)))*180/PI()","v":-70.689407742830738},{"$f":"(ASIN((SIN((F147+12)*15*PI()/180)*COS($C146*PI()/180))/COS(F148*PI()/180)))*180/PI()","v":-85.014879600068582},-81.414400073356092,{"$f":"(ASIN((SIN((H147+12)*15*PI()/180)*COS($C146*PI()/180))/COS(H148*PI()/180)))*180/PI()","v":-68.206675827324545},-55.043642600789816,-41.699664340767399,-28.057639201823172,-14.119993602472398,-1.3246356762201556E-14,14.11999360247237,28.0576392018231,41.699664340767335,55.043642600789838,68.206675827324574,81.414400073356092,85.014879600068511,70.689407742830866,55.186934613298156,38.167537823852079,19.598097612486569,2.7785886881817923E-14,"Summa"]
["direktstr, IDN",null,null,null,null,null,null,null,null,null,{"$f":"1071*EXP(-0.129/SIN(K148*PI()/180))","v":15.094627180954896},{"$f":"1071*EXP(-0.129/SIN(L148*PI()/180))","v":167.13003481038933},225.54765653857069,167.13003481038933,15.094627180955486,null,null,null,null,null,null,null,null,null,null,{"$f":"SUM(B150:Y150)","v":589.99698052125973}]
["andel,%",null,null,null,null,null,null,null,null,null,{"$f":"K150/$Z150","v":2.558424480006467E-2},{"$f":"L150/$Z150","v":0.28327269516316961},0.38228612007353041,0.28327269516316961,2.5584244800065672E-2,null,null,null,null,null,null,null,null,null,null,{"$f":"SUM(B151:Y151)","v":1}]
["Uppmätt IDN förd",null,null,null,null,null,null,null,null,null,{"$f":"K151*$K4","v":343.53895940609016},{"$f":"L151*$K4","v":3803.7162200804105},{"$f":"M151*$K4","v":5133.2441864815301},{"$f":"N151*$K4","v":3803.7162200804105},{"$f":"O151*$K4","v":343.53895940610363},null,null,null,null,null,null,null,null,null,null,{"$f":"SUM(B152:Y152)","v":13427.754545454543}]
["Direktstr, IDH",null,null,null,null,null,null,null,null,null,{"$f":"K152*SIN(K148*PI()/180)","v":10.398036142985207},{"$f":"L152*SIN(L148*PI()/180)","v":264.150385397739},425.0747498049796,264.150385397739,10.39803614298571,null,null,null,null,null,null,null,null,null,null,{"$f":"SUM(B153:Y153)","v":974.17159288642858}]
["Global IDN + IdH ",null,null,null,null,null,null,null,null,null,{"$f":"244*SIN(K148*PI()/180)","v":7.385249181852803},{"$f":"244*SIN(L148*PI()/180)","v":16.94466419360953},20.205202632977883,16.94466419360953,7.3852491818528705,null,null,null,null,null,null,null,null,null,null,68.865029383902609]
["andel,%",null,null,null,null,null,null,null,null,null,{"$f":"K154/$Z154","v":0.1072423732034176},{"$f":"L154/$Z154","v":0.24605615281375878},0.29340294796564637,0.24605615281375878,0.10724237320341859,null,null,null,null,null,null,null,null,null,null,1.0000000000000002]
["Global IDH + IdH förd",null,null,null,null,null,null,null,null,null,{"$f":"K155*$T4","v":333.83283368358775},{"$f":"L155*$T4","v":765.94372434571687},913.32870212320677,765.94372434571687,333.83283368359082,null,null,null,null,null,null,null,null,null,null,3112.8818181818192,null,{"$f":"Z153+Z157","v":3112.8818181818192}]
["Diffusstrål IdH förd",null,null,null,null,null,null,null,null,null,{"$f":"K156-K153","v":323.43479754060252},{"$f":"L156-L153","v":501.79333894797787},488.25395231822716,501.79333894797787,323.43479754060513,null,null,null,null,null,null,null,null,null,null,{"$f":"SUM(B157:Y157)","v":2138.7102252953905}]
[]
["Februari","deklination",-10.9]
["Kl",1,2,3,4,5,6,7,8,9,10,11,12,13,14,15,16,17,18,19,20,21,22,23,24]
["solhöjd",{"$f":"ASIN(SIN($C$145*PI()/180)*SIN($C159*PI()/180)+COS($C$145*PI()/180)*COS($C159*PI()/180)*COS((B160+12)*15*PI()/180))*180/PI()","v":-34.573162413863834},-31.772239496516448,-27.481287902470111,-22.125613150675079,-16.132695221249886,-9.8961930799943936,-3.7764874461696119,1.8860090301901529,6.761205345766891,10.53386536158413,12.928257640867132,13.750000000000007,12.928257640867136,10.533865361584146,6.7612053457669132,1.8860090301901435,-3.7764874461696216,-9.8961930799943829,-16.132695221249879,-22.12561315067504,-27.481287902470118,-31.772239496516463,-34.573162413863834,-35.550000000000011]
["azimut",{"$f":"(ASIN((SIN((B160+12)*15*PI()/180)*COS($C159*PI()/180))/COS(B161*PI()/180)))*180/PI()","v":-17.978368237555284},{"$f":"(ASIN((SIN((C160+12)*15*PI()/180)*COS($C159*PI()/180))/COS(C161*PI()/180)))*180/PI()","v":-35.276460814830649},-51.505163711509383,{"$f":"(ASIN((SIN((E160+12)*15*PI()/180)*COS($C159*PI()/180))/COS(E161*PI()/180)))*180/PI()","v":-66.635797169636987},{"$f":"(ASIN((SIN((F160+12)*15*PI()/180)*COS($C159*PI()/180))/COS(F161*PI()/180)))*180/PI()","v":-80.888349960728263},-85.408099636752326,{"$f":"(ASIN((SIN((H160+12)*15*PI()/180)*COS($C159*PI()/180))/COS(H161*PI()/180)))*180/PI()","v":-71.908784352280406},-58.305562226950798,-44.363846538545168,-29.960025219485324,-15.115140040185008,-1.419261342532653E-14,15.115140040184988,29.960025219485242,44.363846538545104,58.305562226950826,71.908784352280435,85.408099636752425,80.888349960728306,66.635797169637044,51.505163711509354,35.276460814830621,17.978368237555319,2.5416186082644946E-14,"Summa"]
["direktstr, IDN",null,null,null,null,null,null,null,{"$f":"1071*EXP(-0.129/SIN(I161*PI()/180))","v":21.2573054062713},358.03671628171048,528.85965549071716,601.70203157097251,622.41991867441675,601.70203157097262,528.85965549071773,358.03671628171173,21.257305406270877,null,null,null,null,null,null,null,null,{"$f":"SUM(B163:Y163)","v":3642.1313361737607}]
["andel,%",null,null,null,null,null,null,null,{"$f":"I163/$Z163","v":5.836501609687462E-3},9.8304175010296521E-2,{"$f":"K163/$Z163","v":0.14520609134494047},{"$f":"L163/$Z163","v":0.16520602252720801},0.17089441901573479,0.16520602252720804,0.14520609134494061,9.8304175010296868E-2,5.8365016096873458E-3,null,null,null,null,null,null,null,null,{"$f":"SUM(B164:Y164)","v":1}]
["Uppmätt IDN förd",null,null,null,null,null,null,null,{"$f":"I164*$K5","v":238.81107518147104},4022.2940554099373,5941.3712384534128,6759.7047862871286,6992.4558711542722,6759.7047862871304,5941.3712384534183,4022.2940554099519,238.81107518146629,null,null,null,null,null,null,null,null,{"$f":"SUM(B165:Y165)","v":40916.818181818191}]
["Direktstr, IDH",null,null,null,null,"ggr sin h",null,null,{"$f":"I165*SIN(I161*PI()/180)","v":7.8595407083852011},473.55115416475007,{"$f":"K165*SIN(K161*PI()/180)","v":1086.1816355283154},{"$f":"L165*SIN(L161*PI()/180)","v":1512.3543638384024},{"$f":"M165*SIN(M161*PI()/180)","v":1662.0081132866922},1512.3543638384031,{"$f":"O165*SIN(O161*PI()/180)","v":1086.1816355283181},{"$f":"P165*SIN(P161*PI()/180)","v":473.55115416475337},7.8595407083850048,null,null,null,null,null,null,null,null,7821.9015017664042]
["Global IdH",null,null,null,null,null,null,null,{"$f":"244*SIN(I161*PI()/180)","v":8.0303140521800316},{"$f":"244*SIN(J161*PI()/180)","v":28.726512787097299},44.607264624975357,54.590322572246087,57.995357727586267,54.590322572246102,44.607264624975429,28.726512787097395,8.0303140521799907,null,null,null,null,null,null,null,null,329.904185800584]
["andel,%",null,null,null,null,null,null,null,{"$f":"I167/$Z167","v":2.4341352422348733E-2},{"$f":"J167/$Z167","v":8.7075320724974106E-2},0.13521278766659525,0.16547326442606614,0.17579454952003098,0.16547326442606616,0.13521278766659547,8.7075320724974398E-2,2.4341352422348608E-2,null,null,null,null,null,null,null,null,0.99999999999999989]
["Global IDH + IdH förd",null,null,null,null,null,null,null,{"$f":"I168*$T5","v":422.32578380308081},{"$f":"J168*$T5","v":1510.7686884856723},2345.9603041228365,2870.9837023283058,3050.059406156563,2870.9837023283062,2345.9603041228406,1510.7686884856773,422.32578380307865,null,null,null,null,null,null,null,null,17350.136363636364,null,{"$f":"Z166+Z170","v":17350.13636363636}]
["Diffusstrål IdH",null,null,null,null,null,null,null,{"$f":"I169-I166","v":414.46624309469559},{"$f":"J169-J166","v":1037.2175343209224},1259.7786685945212,1358.6293384899034,1388.0512928698708,1358.6293384899031,1259.7786685945225,1037.217534320924,414.46624309469365,null,null,null,null,null,null,null,null,9528.2348618699561]
[]
["Mars","deklination",0]
["Kl",1,2,3,4,5,6,7,8,9,10,11,12,13,14,15,16,17,18,19,20,21,22,23,24]
["solhöjd",{"$f":"ASIN(SIN($C$145*PI()/180)*SIN($C172*PI()/180)+COS($C$145*PI()/180)*COS($C172*PI()/180)*COS((B173+12)*15*PI()/180))*180/PI()","v":-23.757258135451785},-21.173711278102747,-17.152495552862863,-12.036633167999211,-6.1969663571147153,-4.3915296665422253E-15,6.196966357114726,12.036633167999202,17.152495552862849,21.173711278102743,23.757258135451778,24.650000000000006,23.757258135451785,21.173711278102754,17.152495552862877,12.03663316799919,6.1969663571147162,7.3192161109037093E-15,-6.1969663571147047,-12.036633167999179,-17.152495552862863,-21.173711278102754,-23.757258135451778,-24.650000000000006]
["azimut",{"$f":"(ASIN((SIN((B173+12)*15*PI()/180)*COS($C172*PI()/180))/COS(B174*PI()/180)))*180/PI()","v":-16.426304677686925},{"$f":"(ASIN((SIN((C173+12)*15*PI()/180)*COS($C172*PI()/180))/COS(C174*PI()/180)))*180/PI()","v":-32.425260891770854},-47.733163584916227,{"$f":"(ASIN((SIN((E173+12)*15*PI()/180)*COS($C172*PI()/180))/COS(E174*PI()/180)))*180/PI()","v":-62.312306458967676},{"$f":"(ASIN((SIN((F173+12)*15*PI()/180)*COS($C172*PI()/180))/COS(F174*PI()/180)))*180/PI()","v":-76.313092528228083},-90,{"$f":"(ASIN((SIN((H173+12)*15*PI()/180)*COS($C172*PI()/180))/COS(H174*PI()/180)))*180/PI()","v":-76.313092528228026},-62.312306458967733,-47.733163584916255,-32.425260891770876,-16.42630467768695,-1.5446795136835537E-14,16.426304677686918,32.425260891770797,47.73316358491617,62.312306458967733,76.313092528228054,90,76.313092528228083,62.312306458967775,47.733163584916205,32.425260891770826,16.426304677686954,2.3170192705253306E-14,"Summa"]
["direktstr, IDN",null,null,null,null,null,null,{"$f":"1071*EXP(-0.129/SIN(H174*PI()/180))","v":324.18490771610448},576.94846401733128,691.54986697397715,749.3468859971772,777.54356240724223,786.07366382710063,777.54356240724223,749.34688599717754,691.54986697397771,576.94846401733105,324.18490771610379,0,null,null,null,null,null,null,{"$f":"SUM(B176:Y176)","v":7025.2210380507649}]
["andel,%",null,null,null,null,null,null,{"$f":"H176/$Z176","v":4.6145865868165423E-2},8.212531120265118E-2,{"$f":"J176/$Z176","v":9.8438164895927077E-2},{"$f":"K176/$Z176","v":0.106665239703987},{"$f":"L176/$Z176","v":0.11067887518354602},0.11189308629144665,0.11067887518354602,0.10666523970398704,9.8438164895927147E-2,8.2125311202651152E-2,4.6145865868165326E-2,0,null,null,null,null,null,null,{"$f":"SUM(B177:Y177)","v":1}]
["Uppmätt IDN förd",null,null,null,null,null,null,{"$f":"H177*$K6","v":4480.4590130841334},7973.8256907234927,9557.6961195062067,10356.490784675092,10746.188299746109,10864.080184529947,10746.188299746109,10356.490784675096,9557.696119506214,7973.82569072349,4480.4590130841234,0,null,null,null,null,null,null,97093.400000000023]
["Direktstr, IDH",null,null,null,null,"ggr sin h",null,{"$f":"H178*SIN(H174*PI()/180)","v":483.65084643482572},1662.8380542275556,{"$f":"J178*SIN(J174*PI()/180)","v":2818.7167307630889},{"$f":"K178*SIN(K174*PI()/180)","v":3740.7309039090446},{"$f":"L178*SIN(L174*PI()/180)","v":4329.2377538244746},{"$f":"M178*SIN(M174*PI()/180)","v":4531.1263766481443},{"$f":"N178*SIN(N174*PI()/180)","v":4329.2377538244746},{"$f":"O178*SIN(O174*PI()/180)","v":3740.7309039090487},{"$f":"P178*SIN(P174*PI()/180)","v":2818.7167307630957},{"$f":"Q178*SIN(Q174*PI()/180)","v":1662.8380542275538},483.65084643482379,null,null,null,null,null,null,null,30601.474954966128]
["Global IdH",null,null,null,null,null,null,{"$f":"244*SIN(H174*PI()/180)","v":26.338999237684018},{"$f":"244*SIN(I174*PI()/180)","v":50.883039204574096},71.959484137870533,88.132009145841351,98.298483375554554,101.76607840914815,98.298483375554568,88.132009145841408,71.95948413787066,50.883039204574054,26.338999237683971,null,null,null,null,null,null,null,772.99010861219733]
["andel,%",null,null,null,null,null,null,{"$f":"H180/$Z180","v":3.4074173710931757E-2},{"$f":"I180/$Z180","v":6.5826248793697945E-2},9.3092373804193149E-2,0.11401440738235429,0.12716654751512491,0.13165249758739583,0.12716654751512493,0.11401440738235435,9.3092373804193315E-2,6.5826248793697889E-2,3.4074173710931695E-2,null,null,null,null,null,null,null,1]
["Global IDH + IdH förd",null,null,null,null,null,null,{"$f":"H181*$T6","v":2013.5897532911306},{"$f":"I181*$T6","v":3889.9566925098688},5501.2295115914394,6737.6026306696731,7514.8192648825707,7779.913385019735,7514.8192648825716,6737.6026306696767,5501.2295115914494,3889.9566925098657,2013.589753291127,null,null,null,null,null,null,null,59094.309090909104,null,{"$f":"Z179+Z183","v":59094.309090909104}]
["Diffusstrål IdH",null,null,null,null,null,null,{"$f":"H182-H179","v":1529.9389068563048},{"$f":"I182-I179","v":2227.1186382823134},2682.5127808283505,2996.8717267606285,3185.5815110580961,3248.7870083715907,3185.581511058097,2996.871726760628,2682.5127808283537,2227.1186382823116,1529.9389068563032,null,null,null,null,null,null,null,28492.834135942976]
[]
["April","deklination",10.9]
["Kl",1,2,3,4,5,6,7,8,9,10,11,12,13,14,15,16,17,18,19,20,21,22,23,24]
["solhöjd",{"$f":"ASIN(SIN($C$145*PI()/180)*SIN($C185*PI()/180)+COS($C$145*PI()/180)*COS($C185*PI()/180)*COS((B186+12)*15*PI()/180))*180/PI()","v":-12.928257640867136},-10.533865361584136,-6.7612053457668972,-1.8860090301901609,3.7764874461696234,9.8961930799943865,16.132695221249904,22.125613150675065,27.481287902470104,31.772239496516445,34.573162413863834,35.550000000000011,34.573162413863834,31.77223949651647,27.481287902470122,22.125613150675058,16.132695221249893,9.8961930799943971,3.7764874461696341,-1.8860090301901324,-6.7612053457669035,-10.533865361584139,-12.928257640867134,-13.750000000000007]
["azimut",{"$f":"(ASIN((SIN((B186+12)*15*PI()/180)*COS($C185*PI()/180))/COS(B187*PI()/180)))*180/PI()","v":-15.115140040184992},{"$f":"(ASIN((SIN((C186+12)*15*PI()/180)*COS($C185*PI()/180))/COS(C187*PI()/180)))*180/PI()","v":-29.960025219485299},-44.363846538545168,{"$f":"(ASIN((SIN((E186+12)*15*PI()/180)*COS($C185*PI()/180))/COS(E187*PI()/180)))*180/PI()","v":-58.305562226950769},{"$f":"(ASIN((SIN((F186+12)*15*PI()/180)*COS($C185*PI()/180))/COS(F187*PI()/180)))*180/PI()","v":-71.908784352280449},-85.408099636752326,{"$f":"(ASIN((SIN((H186+12)*15*PI()/180)*COS($C185*PI()/180))/COS(H187*PI()/180)))*180/PI()","v":-80.888349960728263},-66.635797169636987,-51.505163711509411,-35.276460814830664,-17.978368237555308,-1.694412405509663E-14,17.97836823755528,35.276460814830585,51.505163711509319,66.635797169637016,80.888349960728263,85.408099636752425,71.908784352280449,58.305562226950862,44.363846538545147,29.960025219485278,15.11514004018502,2.1288920137989795E-14,"Summa"]
["direktstr, IDN",null,null,null,null,{"$f":"1071*EXP(-0.129/SIN(F187*PI()/180))","v":151.07545382744988},505.60363478182575,673.23219264015427,760.3999198449884,809.81018611502998,838.28176296074628,853.22093188452084,857.88913414716876,853.22093188452084,838.28176296074639,809.81018611503009,760.39991984498829,673.23219264015393,505.60363478182609,151.07545382745076,null,null,null,null,null,{"$f":"SUM(B189:Y189)","v":10041.137298256601}]
["andel,%",null,null,null,null,{"$f":"F189/$Z189","v":1.5045651636859945E-2},{"$f":"G189/$Z189","v":5.0353223919128318E-2},{"$f":"H189/$Z189","v":6.7047404356979035E-2},{"$f":"I189/$Z189","v":7.5728465537167125E-2},{"$f":"J189/$Z189","v":8.0649249388874883E-2},{"$f":"K189/$Z189","v":8.3484742620369659E-2},{"$f":"L189/$Z189","v":8.4972539119912427E-2},8.5437446841417089E-2,8.4972539119912427E-2,8.3484742620369673E-2,8.0649249388874897E-2,7.5728465537167111E-2,6.7047404356978993E-2,5.0353223919128352E-2,1.5045651636860034E-2,null,null,null,null,null,{"$f":"SUM(B190:Y190)","v":0.99999999999999978}]
["Uppmätt IDN förd",null,null,null,null,{"$f":"F190*$K7","v":1978.0505896901159},6619.9342288385706,8814.716765115314,9956.0151682060005,10602.95021858043,10975.732281730148,11171.332765796231,11232.454145904545,11171.332765796231,10975.73228173015,10602.950218580432,9956.0151682059986,8814.7167651153086,6619.9342288385751,1978.0505896901275,null,null,null,null,null,{"$f":"SUM(B191:Y191)","v":131469.91818181818}]
["Direktstr, IDH",null,"ggr sin h",null,null,{"$f":"F191*SIN(F187*PI()/180)","v":130.28316583021186},{"$f":"G191*SIN(G187*PI()/180)","v":1137.7260328274015},{"$f":"H191*SIN(H187*PI()/180)","v":2449.2824671038311},{"$f":"I191*SIN(I187*PI()/180)","v":3749.8177742454004},{"$f":"J191*SIN(J187*PI()/180)","v":4892.8257634606653},{"$f":"K191*SIN(K187*PI()/180)","v":5779.2054329777056},{"$f":"L191*SIN(L187*PI()/180)","v":6339.2635138369851},{"$f":"M191*SIN(M187*PI()/180)","v":6530.6969326968465},{"$f":"N191*SIN(N187*PI()/180)","v":6339.2635138369851},{"$f":"O191*SIN(O187*PI()/180)","v":5779.2054329777111},{"$f":"P191*SIN(P187*PI()/180)","v":4892.8257634606689},{"$f":"Q191*SIN(Q187*PI()/180)","v":3749.8177742453981},{"$f":"R191*SIN(R187*PI()/180)","v":2449.2824671038279},{"$f":"S191*SIN(S187*PI()/180)","v":1137.7260328274035},{"$f":"T191*SIN(T187*PI()/180)","v":130.28316583021299},null,null,null,null,null,{"$f":"SUM(B192:Y192)","v":55487.505233261261}]
["Global IdH",null,null,null,null,{"$f":"244*SIN(F187*PI()/180)","v":16.070919838077455},{"$f":"244*SIN(G187*PI()/180)","v":41.934729623226211},67.798539408375049,91.899773298632468,112.59597203354974,128.47672387142779,138.45978181869853,141.86481697403872,138.45978181869853,128.47672387142785,112.59597203354981,91.899773298632425,67.798539408374992,41.934729623226254,16.070919838077504,null,null,null,null,null,1336.3376967580134]
["andel,%",null,null,null,null,{"$f":"F193/$Z193","v":1.2026091815763248E-2},{"$f":"G193/$Z193","v":3.1380338760899171E-2},5.0734585706035153E-2,6.8769872706265389E-2,8.4257124757245283E-2,9.614091122559465E-2,0.10361137170238123,0.10615940665163161,0.10361137170238123,9.6140911225594691E-2,8.4257124757245325E-2,6.8769872706265361E-2,5.0734585706035111E-2,3.1380338760899205E-2,1.2026091815763286E-2,null,null,null,null,null,0.99999999999999978]
["Global IDH + IdH förd",null,null,null,null,{"$f":"F194*$T7","v":1284.5143011529765},{"$f":"G194*$T7","v":3351.7533818065103},5418.9924624600499,7345.3526160411511,8999.5555815439438,10268.870160569066,11066.794662197481,11338.951850275791,11066.794662197481,10268.870160569071,8999.5555815439493,7345.3526160411475,5418.9924624600462,3351.753381806514,1284.5143011529806,null,null,null,null,null,106810.61818181816,null,{"$f":"Z192+Z196","v":106810.61818181816}]
["Diffusstrål IdH",null,null,null,null,{"$f":"F195-F192","v":1154.2311353227647},{"$f":"G195-G192","v":2214.0273489791089},2969.7099953562188,3595.5348417957507,4106.7298180832786,4489.6647275913601,4727.5311483604955,4808.2549175789445,4727.5311483604955,4489.6647275913601,4106.7298180832804,3595.5348417957493,2969.7099953562183,2214.0273489791107,1154.2311353227676,null,null,null,null,null,51323.112948556911]
[]
["Maj","deklination",19.899999999999999]
["Kl",1,2,3,4,5,6,7,8,9,10,11,12,13,14,15,16,17,18,19,20,21,22,23,24]
["solhöjd",{"$f":"ASIN(SIN($C$145*PI()/180)*SIN($C198*PI()/180)+COS($C$145*PI()/180)*COS($C198*PI()/180)*COS((B199+12)*15*PI()/180))*180/PI()","v":-3.9821303036876587},-1.7344600145682481,1.8369694311894194,6.5042377559299256,11.997006842981138,18.02076231385438,24.259035180587482,30.360997672174946,35.920882040456682,40.465543084494499,43.485309064729677,44.550000000000004,43.485309064729677,40.465543084494527,35.920882040456704,30.360997672174932,24.259035180587475,18.020762313854391,11.997006842981149,6.5042377559299531,1.836969431189416,-1.7344600145682545,-3.9821303036876587,-4.7500000000000062]
["azimut",{"$f":"(ASIN((SIN((B199+12)*15*PI()/180)*COS($C198*PI()/180))/COS(B200*PI()/180)))*180/PI()","v":-14.119993602472373},{"$f":"(ASIN((SIN((C199+12)*15*PI()/180)*COS($C198*PI()/180))/COS(C200*PI()/180)))*180/PI()","v":-28.057639201823154},-41.699664340767384,{"$f":"(ASIN((SIN((E199+12)*15*PI()/180)*COS($C198*PI()/180))/COS(E200*PI()/180)))*180/PI()","v":-55.043642600789781},{"$f":"(ASIN((SIN((F199+12)*15*PI()/180)*COS($C198*PI()/180))/COS(F200*PI()/180)))*180/PI()","v":-68.20667582732456},-81.414400073356092,{"$f":"(ASIN((SIN((H199+12)*15*PI()/180)*COS($C198*PI()/180))/COS(H200*PI()/180)))*180/PI()","v":-85.01487960006844},-70.689407742830809,-55.186934613298199,-38.167537823852136,-19.598097612486562,-1.8523924587878619E-14,19.598097612486526,38.167537823852044,55.186934613298114,70.689407742830824,85.014879600068511,81.414400073356134,68.206675827324588,55.04364260078988,41.699664340767363,28.057639201823125,14.1199936024724,1.9869535143302333E-14,"Summa"]
["direktstr, IDN",null,null,{"$f":"1071*EXP(-0.129/SIN(D200*PI()/180))","v":19.146105144218541},342.93595760824439,575.78815754879167,705.82005453092074,782.40656865048925,829.75310237288863,859.59559161047139,877.93966028381294,887.93096477417748,891.10712232770788,887.93096477417748,877.93966028381294,859.5955916104715,829.75310237288852,782.40656865048925,705.82005453092097,575.78815754879179,342.93595760824599,19.146105144218403,null,null,null,{"$f":"SUM(B202:Y202)","v":12653.739447375739}]
["andel,%",null,null,{"$f":"D202/$Z202","v":1.5130788194148612E-3},{"$f":"E202/$Z202","v":2.7101550417917442E-2},{"$f":"F202/$Z202","v":4.5503399208066071E-2},{"$f":"G202/$Z202","v":5.5779562829334287E-2},{"$f":"H202/$Z202","v":6.1832043555531929E-2},{"$f":"I202/$Z202","v":6.5573746466304178E-2},{"$f":"J202/$Z202","v":6.7932139363652139E-2},{"$f":"K202/$Z202","v":6.9381834827165575E-2},{"$f":"L202/$Z202","v":7.0171427858689281E-2},{"$f":"M202/$Z202","v":7.0422433307848351E-2},{"$f":"N202/$Z202","v":7.0171427858689281E-2},{"$f":"O202/$Z202","v":6.9381834827165575E-2},{"$f":"P202/$Z202","v":6.7932139363652153E-2},{"$f":"Q202/$Z202","v":6.5573746466304164E-2},{"$f":"R202/$Z202","v":6.1832043555531929E-2},{"$f":"S202/$Z202","v":5.57795628293343E-2},{"$f":"T202/$Z202","v":4.5503399208066085E-2},{"$f":"U202/$Z202","v":2.7101550417917567E-2},{"$f":"V202/$Z202","v":1.5130788194148502E-3},null,null,null,{"$f":"SUM(B203:Y203)","v":1}]
["Uppmätt IDN förd",null,null,{"$f":"D203*$K8","v":273.28748202101411},4894.9958042783728,8218.6791814179596,10074.727157807174,11167.906968679772,11843.721443005104,12269.686864146692,12531.526246099105,12674.140027111453,12719.475832684862,12674.140027111453,12531.526246099105,12269.686864146694,11843.721443005101,11167.906968679772,10074.727157807176,8218.6791814179614,4894.9958042783956,273.28748202101207,null,null,null,180616.81818181821]
["Direktstr, IDH",null,"ggr sin h",{"$f":"D204*SIN(D200*PI()/180)","v":8.7604139961662835},{"$f":"E204*SIN(E200*PI()/180)","v":554.48897518040008},{"$f":"F204*SIN(F200*PI()/180)","v":1708.3395173801146},{"$f":"G204*SIN(G200*PI()/180)","v":3116.7338050781441},{"$f":"H204*SIN(H200*PI()/180)","v":4588.4755906703131},{"$f":"I204*SIN(I200*PI()/180)","v":5986.3677570158943},{"$f":"J204*SIN(J200*PI()/180)","v":7198.2270809766333},{"$f":"K204*SIN(K200*PI()/180)","v":8132.843150139729},{"$f":"L204*SIN(L200*PI()/180)","v":8721.9447337031761},{"$f":"M204*SIN(M200*PI()/180)","v":8923.1120159613529},{"$f":"N204*SIN(N200*PI()/180)","v":8721.9447337031761},{"$f":"O204*SIN(O200*PI()/180)","v":8132.8431501397336},{"$f":"P204*SIN(P200*PI()/180)","v":7198.2270809766387},{"$f":"Q204*SIN(Q200*PI()/180)","v":5986.3677570158898},{"$f":"R204*SIN(R200*PI()/180)","v":4588.4755906703131},{"$f":"S204*SIN(S200*PI()/180)","v":3116.7338050781473},{"$f":"T204*SIN(T200*PI()/180)","v":1708.3395173801161},{"$f":"U204*SIN(U200*PI()/180)","v":554.48897518040496},{"$f":"V204*SIN(V200*PI()/180)","v":8.7604139961662018},null,null,null,88955.474064242488]
["Global IdH",null,null,{"$f":"244*SIN(D200*PI()/180)","v":7.821584066921182},{"$f":"244*SIN(E200*PI()/180)","v":27.639514997288753},50.717984367024762,75.484232627555443,100.25048088808623,123.32895025782216,143.14688118818972,158.35371443696374,167.91312944872047,171.1736678880888,167.91312944872047,158.35371443696383,143.14688118818981,123.32895025782211,100.25048088808622,75.4842326275555,50.717984367024798,27.639514997288867,7.8215840669211687,null,null,null,1880.486612445234]
["andel,%",null,null,{"$f":"D206/$Z206","v":4.1593404681305448E-3},{"$f":"E206/$Z206","v":1.4698065285000112E-2},2.6970670267668199E-2,4.014079766800456E-2,5.3310925068340981E-2,6.5583530051009017E-2,7.6122254867878589E-2,8.4208902838746227E-2,8.9292382268214981E-2,9.1026262434013447E-2,8.9292382268214981E-2,8.4208902838746269E-2,7.612225486787863E-2,6.5583530051009004E-2,5.3310925068340974E-2,4.0140797668004588E-2,2.6970670267668216E-2,1.4698065285000173E-2,4.1593404681305379E-3,null,null,null,1.0000000000000002]
["Global IDH + IdH förd",null,null,{"$f":"D207*$T8","v":667.67676740795707},{"$f":"E207*$T8","v":2359.4021195987316},4329.4580179526229,6443.5884086681044,8557.718799383596,10527.774697737479,12219.500049928254,13517.606568912446,14333.630440643741,14611.960986806849,14333.630440643741,13517.606568912452,12219.500049928261,10527.774697737477,8557.7187993835942,6443.588408668109,4329.4580179526256,2359.4021195987411,667.67676740795594,null,null,null,160524.6727272727,null,{"$f":"Z205+Z209","v":160524.6727272727}]
["Diffusstrål IdH",null,null,{"$f":"D208-D205","v":658.91635341179074},{"$f":"E208-E205","v":1804.9131444183315},2621.1185005725083,3326.8546035899603,3969.2432087132829,4541.4069407215848,5021.2729689516209,5384.7634187727172,5611.6857069405651,5688.8489708454963,5611.6857069405651,5384.7634187727181,5021.2729689516227,4541.4069407215875,3969.2432087132811,3326.8546035899617,2621.1185005725092,1804.9131444183363,658.91635341178971,null,null,null,71569.198663030213]
[]
["Juni","deklination",23.45]
["Kl",1,2,3,4,5,6,7,8,9,10,11,12,13,14,15,16,17,18,19,20,21,22,23,24]
["solhöjd",{"$f":"ASIN(SIN($C$145*PI()/180)*SIN($C211*PI()/180)+COS($C$145*PI()/180)*COS($C211*PI()/180)*COS((B212+12)*15*PI()/180))*180/PI()","v":-0.45291190244184226},1.7374671882333623,5.2284130163218183,9.8093946398218765,15.227564706949675,21.203686909907979,27.433300838266053,33.572936168515952,39.215779195001673,43.871970822014752,46.993291785372186,48.100000000000016,46.993291785372186,43.871970822014781,39.215779195001709,33.572936168515945,27.433300838266046,21.20368690990799,15.227564706949686,9.8093946398219032,5.2284130163218148,1.7374671882333592,-0.4529119024418391,-1.2000000000000113]
["azimut",{"$f":"(ASIN((SIN((B212+12)*15*PI()/180)*COS($C211*PI()/180))/COS(B213*PI()/180)))*180/PI()","v":-13.736086216720128},{"$f":"(ASIN((SIN((C212+12)*15*PI()/180)*COS($C211*PI()/180))/COS(C213*PI()/180)))*180/PI()","v":-27.317106073532052},-40.64841193973394,{"$f":"(ASIN((SIN((E212+12)*15*PI()/180)*COS($C211*PI()/180))/COS(E213*PI()/180)))*180/PI()","v":-53.734663486271536},{"$f":"(ASIN((SIN((F212+12)*15*PI()/180)*COS($C211*PI()/180))/COS(F213*PI()/180)))*180/PI()","v":-66.692170237711011},-79.745178438869488,{"$f":"(ASIN((SIN((H212+12)*15*PI()/180)*COS($C211*PI()/180))/COS(H213*PI()/180)))*180/PI()","v":-86.781461856411596},-72.47213500620343,-56.85473569232235,-39.516613153234616,-20.371966506582314,-1.9285732522655332E-14,20.371966506582279,39.516613153234537,56.854735692322294,72.47213500620343,86.781461856411596,79.745178438869488,66.692170237711053,53.734663486271614,40.648411939733911,27.317106073532024,13.736086216720153,1.9323698058415279E-14,"Summa"]
["direktstr, IDN",null,{"$f":"1071*EXP(-0.129/SIN(C213*PI()/180))","v":15.206351616570558},260.01320194274638,502.28981511615643,655.3743091114568,749.70792082163257,809.44508951324633,848.16415307557861,873.32913353180038,889.10390981655212,897.79662490177361,900.57509009460341,897.79662490177361,889.10390981655223,873.32913353180049,848.16415307557861,809.44508951324633,749.70792082163268,655.37430911145702,502.2898151161574,260.01320194274615,15.206351616570437,null,null,{"$f":"SUM(B215:Y215)","v":13901.436108989634}]
["andel,%",null,{"$f":"C215/$Z215","v":1.0938691152014917E-3},{"$f":"D215/$Z215","v":1.8704053300982609E-2},{"$f":"E215/$Z215","v":3.6132224841960103E-2},{"$f":"F215/$Z215","v":4.7144360048358334E-2},{"$f":"G215/$Z215","v":5.3930249719798332E-2},{"$f":"H215/$Z215","v":5.8227443781135889E-2},{"$f":"I215/$Z215","v":6.1012700157438898E-2},{"$f":"J215/$Z215","v":6.2822943376838969E-2},{"$f":"K215/$Z215","v":6.3957702128458208E-2},{"$f":"L215/$Z215","v":6.4583012709111112E-2},{"$f":"M215/$Z215","v":6.4782881641431922E-2},{"$f":"N215/$Z215","v":6.4583012709111112E-2},{"$f":"O215/$Z215","v":6.3957702128458221E-2},{"$f":"P215/$Z215","v":6.2822943376838969E-2},{"$f":"Q215/$Z215","v":6.1012700157438898E-2},{"$f":"R215/$Z215","v":5.8227443781135889E-2},{"$f":"S215/$Z215","v":5.3930249719798339E-2},{"$f":"T215/$Z215","v":4.7144360048358348E-2},{"$f":"U215/$Z215","v":3.6132224841960173E-2},{"$f":"V215/$Z215","v":1.8704053300982591E-2},1.093869115201483E-3,null,null,{"$f":"SUM(B216:Y216)","v":0.99999999999999967}]
["Uppmätt IDN förd",null,{"$f":"C216*$K9","v":198.65076813469935},3396.7268147872896,6561.7486768048129,8561.5940761798756,9793.9373035143199,10574.323996259853,11080.137087529683,11408.884102183458,11614.96058292879,11728.519349186281,11764.816303163701,11728.519349186281,11614.960582928792,11408.884102183458,11080.137087529683,10574.323996259853,9793.9373035143217,8561.5940761798793,6561.7486768048257,3396.7268147872865,198.65076813469776,null,null,181603.7818181818]
["Direktstr, IDH",null,{"$f":"C217*SIN(C213*PI()/180)","v":6.0230665921735662},309.53158420395351,{"$f":"E217*SIN(E213*PI()/180)","v":1117.9321539341718},{"$f":"F217*SIN(F213*PI()/180)","v":2248.7319030189738},{"$f":"G217*SIN(G213*PI()/180)","v":3542.3159353741257},{"$f":"H217*SIN(H213*PI()/180)","v":4871.75722534341},{"$f":"I217*SIN(I213*PI()/180)","v":6127.2942552412314},{"$f":"J217*SIN(J213*PI()/180)","v":7213.183660898284},{"$f":"K217*SIN(K213*PI()/180)","v":8049.7397286170617},{"$f":"L217*SIN(L213*PI()/180)","v":8576.7594751647757},{"$f":"M217*SIN(M213*PI()/180)","v":8756.6886137332658},{"$f":"N217*SIN(N213*PI()/180)","v":8576.7594751647757},{"$f":"O217*SIN(O213*PI()/180)","v":8049.7397286170681},{"$f":"P217*SIN(P213*PI()/180)","v":7213.1836608982903},{"$f":"Q217*SIN(Q213*PI()/180)","v":6127.2942552412296},{"$f":"R217*SIN(R213*PI()/180)","v":4871.7572253434082},{"$f":"S217*SIN(S213*PI()/180)","v":3542.315935374128},{"$f":"T217*SIN(T213*PI()/180)","v":2248.7319030189765},{"$f":"U217*SIN(U213*PI()/180)","v":1117.932153934177},{"$f":"V217*SIN(V213*PI()/180)","v":309.53158420395295},6.0230665921735076,null,null,92883.226590509599]
["Global IdH",null,{"$f":"244*SIN(C213*PI()/180)","v":7.3980496641917721},{"$f":"244*SIN(D213*PI()/180)","v":22.234848624555706},41.570541481446007,64.087432720408941,88.25103341443122,112.41463410845357,134.93152534741643,154.26721820430672,169.10401716467064,178.43081889832902,181.61201728040163,178.43081889832902,169.10401716467075,154.26721820430686,134.93152534741643,112.41463410845354,88.251033414431262,64.087432720408998,41.570541481446121,22.234848624555688,7.3980496641917597,null,null,2126.992256536822]
["andel,%",null,{"$f":"C219/$Z219","v":3.4781742347465379E-3},{"$f":"D219/$Z219","v":1.0453657532707045E-2},1.9544284354439233E-2,3.0130543505013214E-2,4.1490998917937734E-2,5.2851454330862288E-2,6.3437713481436231E-2,7.2528340303168418E-2,7.9503823601128912E-2,8.3888795716092951E-2,8.5384428044934735E-2,8.3888795716092951E-2,7.9503823601128967E-2,7.2528340303168487E-2,6.3437713481436231E-2,5.2851454330862274E-2,4.1490998917937755E-2,3.0130543505013242E-2,1.9544284354439286E-2,1.0453657532707038E-2,3.4781742347465318E-3,null,null,0.99999999999999989]
["Global IDH + IdH förd",null,{"$f":"C220*$T9","v":602.42840965415564},{"$f":"D220*$T9","v":1810.5994287421913},3385.1185555491365,5218.6849135989878,7186.3439857023113,9154.0030578056412,10987.569415855485,12562.088542662432,13770.259561750465,14529.747614765758,14788.794846008661,14529.747614765758,13770.259561750474,12562.088542662443,10987.569415855485,9154.0030578056394,7186.343985702315,5218.6849135989924,3385.1185555491456,1810.5994287421902,602.42840965415462,null,null,173202.48181818181,null,{"$f":"Z218+Z222","v":173202.48181818181}]
["Diffusstrål IdH",null,{"$f":"C221-C218","v":596.40534306198208},{"$f":"D221-D218","v":1501.0678445382378},2267.1864016149648,2969.9530105800141,3644.0280503281856,4282.2458324622312,4860.2751606142538,5348.9048817641478,5720.5198331334032,5952.9881396009823,6032.1062322753951,5952.9881396009823,5720.5198331334059,5348.9048817641524,4860.2751606142556,4282.2458324622312,3644.028050328187,2969.9530105800159,2267.1864016149684,1501.0678445382373,596.40534306198106,null,null,80319.255227672213]
[]
["Juli","deklination",19.899999999999999]
["Kl",1,2,3,4,5,6,7,8,9,10,11,12,13,14,15,16,17,18,19,20,21,22,23,24]
["solhöjd",{"$f":"ASIN(SIN($C$145*PI()/180)*SIN($C224*PI()/180)+COS($C$145*PI()/180)*COS($C224*PI()/180)*COS((B225+12)*15*PI()/180))*180/PI()","v":-3.9821303036876587},-1.7344600145682481,1.8369694311894194,6.5042377559299256,11.997006842981138,18.02076231385438,24.259035180587482,30.360997672174946,35.920882040456682,40.465543084494499,43.485309064729677,44.550000000000004,43.485309064729677,40.465543084494527,35.920882040456704,30.360997672174932,24.259035180587475,18.020762313854391,11.997006842981149,6.5042377559299531,1.836969431189416,-1.7344600145682545,-3.9821303036876587,-4.7500000000000062]
["azimut",{"$f":"(ASIN((SIN((B225+12)*15*PI()/180)*COS($C224*PI()/180))/COS(B226*PI()/180)))*180/PI()","v":-14.119993602472373},{"$f":"(ASIN((SIN((C225+12)*15*PI()/180)*COS($C224*PI()/180))/COS(C226*PI()/180)))*180/PI()","v":-28.057639201823154},-41.699664340767384,{"$f":"(ASIN((SIN((E225+12)*15*PI()/180)*COS($C224*PI()/180))/COS(E226*PI()/180)))*180/PI()","v":-55.043642600789781},{"$f":"(ASIN((SIN((F225+12)*15*PI()/180)*COS($C224*PI()/180))/COS(F226*PI()/180)))*180/PI()","v":-68.20667582732456},-81.414400073356092,{"$f":"(ASIN((SIN((H225+12)*15*PI()/180)*COS($C224*PI()/180))/COS(H226*PI()/180)))*180/PI()","v":-85.01487960006844},-70.689407742830809,-55.186934613298199,-38.167537823852136,-19.598097612486562,-1.8523924587878619E-14,19.598097612486526,38.167537823852044,55.186934613298114,70.689407742830824,85.014879600068511,81.414400073356134,68.206675827324588,55.04364260078988,41.699664340767363,28.057639201823125,14.1199936024724,1.9869535143302333E-14,"Summa"]
["direktstr, IDN",null,null,{"$f":"1071*EXP(-0.129/SIN(D226*PI()/180))","v":19.146105144218541},342.93595760824439,575.78815754879167,705.82005453092074,782.40656865048925,829.75310237288863,859.59559161047139,877.93966028381294,887.93096477417748,891.10712232770788,887.93096477417748,877.93966028381294,859.5955916104715,829.75310237288852,782.40656865048925,705.82005453092097,575.78815754879179,342.93595760824599,19.146105144218403,null,null,null,{"$f":"SUM(B228:Y228)","v":12653.739447375739}]
["andel,%",null,null,{"$f":"D228/$Z228","v":1.5130788194148612E-3},{"$f":"E228/$Z228","v":2.7101550417917442E-2},{"$f":"F228/$Z228","v":4.5503399208066071E-2},{"$f":"G228/$Z228","v":5.5779562829334287E-2},{"$f":"H228/$Z228","v":6.1832043555531929E-2},{"$f":"I228/$Z228","v":6.5573746466304178E-2},{"$f":"J228/$Z228","v":6.7932139363652139E-2},{"$f":"K228/$Z228","v":6.9381834827165575E-2},{"$f":"L228/$Z228","v":7.0171427858689281E-2},{"$f":"M228/$Z228","v":7.0422433307848351E-2},{"$f":"N228/$Z228","v":7.0171427858689281E-2},{"$f":"O228/$Z228","v":6.9381834827165575E-2},{"$f":"P228/$Z228","v":6.7932139363652153E-2},{"$f":"Q228/$Z228","v":6.5573746466304164E-2},{"$f":"R228/$Z228","v":6.1832043555531929E-2},{"$f":"S228/$Z228","v":5.57795628293343E-2},{"$f":"T228/$Z228","v":4.5503399208066085E-2},{"$f":"U228/$Z228","v":2.7101550417917567E-2},{"$f":"V228/$Z228","v":1.5130788194148502E-3},null,null,null,{"$f":"SUM(B229:Y229)","v":1}]
["Uppmätt IDN förd",null,null,{"$f":"D229*$K10","v":271.14291287868548},4856.5832986046726,8154.1847317167749,9995.6677408875512,11080.269040691597,11750.780195388605,12173.402937637169,12433.187587134847,12574.682234874905,12619.662276734016,12574.682234874905,12433.187587134847,12173.402937637171,11750.780195388603,11080.269040691597,9995.667740887553,8154.1847317167767,4856.5832986046953,271.14291287868349,null,null,null,179199.46363636365]
["Direktstr, IDH",null,null,{"$f":"D230*SIN(D226*PI()/180)","v":8.6916683902890348},{"$f":"E230*SIN(E226*PI()/180)","v":550.13773326789317},{"$f":"F230*SIN(F226*PI()/180)","v":1694.9336629059155},{"$f":"G230*SIN(G226*PI()/180)","v":3092.2758566430634},{"$f":"H230*SIN(H226*PI()/180)","v":4552.4684413881414},{"$f":"I230*SIN(I226*PI()/180)","v":5939.390927080668},{"$f":"J230*SIN(J226*PI()/180)","v":7141.7404261061783},{"$f":"K230*SIN(K226*PI()/180)","v":8069.022281616205},{"$f":"L230*SIN(L226*PI()/180)","v":8653.5010077093248},{"$f":"M230*SIN(M226*PI()/180)","v":8853.0896697438966},{"$f":"N230*SIN(N226*PI()/180)","v":8653.5010077093248},{"$f":"O230*SIN(O226*PI()/180)","v":8069.0222816162086},{"$f":"P230*SIN(P226*PI()/180)","v":7141.7404261061838},{"$f":"Q230*SIN(Q226*PI()/180)","v":5939.3909270806644},{"$f":"R230*SIN(R226*PI()/180)","v":4552.4684413881405},{"$f":"S230*SIN(S226*PI()/180)","v":3092.2758566430662},{"$f":"T230*SIN(T226*PI()/180)","v":1694.9336629059171},{"$f":"U230*SIN(U226*PI()/180)","v":550.13773326789806},{"$f":"V230*SIN(V226*PI()/180)","v":8.6916683902889567},null,null,null,88257.413679959252]
["Global IdH",null,null,{"$f":"244*SIN(D226*PI()/180)","v":7.821584066921182},{"$f":"244*SIN(E226*PI()/180)","v":27.639514997288753},50.717984367024762,75.484232627555443,100.25048088808623,123.32895025782216,143.14688118818972,158.35371443696374,167.91312944872047,171.1736678880888,167.91312944872047,158.35371443696383,143.14688118818981,123.32895025782211,100.25048088808622,75.4842326275555,50.717984367024798,27.639514997288867,7.8215840669211687,null,null,null,1880.486612445234]
["andel,%",null,null,{"$f":"D232/$Z232","v":4.1593404681305448E-3},{"$f":"E232/$Z232","v":1.4698065285000112E-2},2.6970670267668199E-2,4.014079766800456E-2,5.3310925068340981E-2,6.5583530051009017E-2,7.6122254867878589E-2,8.4208902838746227E-2,8.9292382268214981E-2,9.1026262434013447E-2,8.9292382268214981E-2,8.4208902838746269E-2,7.612225486787863E-2,6.5583530051009004E-2,5.3310925068340974E-2,4.0140797668004588E-2,2.6970670267668216E-2,1.4698065285000173E-2,4.1593404681305379E-3,null,null,null,1.0000000000000002]
["Global IDH + IdH förd",null,null,{"$f":"D233*$T10","v":671.97064363413858},{"$f":"E233*$T10","v":2374.5756004863138},4357.3010668094948,6485.0275786824977,8612.7540905555106,10595.479556878683,12298.084513730859,13604.539246990285,14425.811025603867,14705.931535074864,14425.811025603867,13604.539246990293,12298.084513730866,10595.479556878681,8612.7540905555106,6485.0275786825023,4357.3010668094976,2374.5756004863238,671.97064363413745,null,null,null,161557.01818181822,null,{"$f":"Z231+Z235","v":161557.01818181819}]
["Diffusstrål IdH",null,null,{"$f":"D234-D231","v":663.27897524384957},{"$f":"E234-E231","v":1824.4378672184207},2662.3674039035795,3392.7517220394343,4060.2856491673692,4656.0886297980151,5156.3440876246805,5535.5169653740804,5772.3100178945424,5852.8418653309673,5772.3100178945424,5535.5169653740841,5156.3440876246823,4656.0886297980169,4060.2856491673701,3392.7517220394361,2662.3674039035805,1824.4378672184257,663.27897524384844,null,null,null,73299.604501858936]
[]
["Augusti","deklination",10.9]
["Kl",1,2,3,4,5,6,7,8,9,10,11,12,13,14,15,16,17,18,19,20,21,22,23,24]
["solhöjd",{"$f":"ASIN(SIN($C$145*PI()/180)*SIN($C237*PI()/180)+COS($C$145*PI()/180)*COS($C237*PI()/180)*COS((B238+12)*15*PI()/180))*180/PI()","v":-12.928257640867136},-10.533865361584136,-6.7612053457668972,-1.8860090301901609,3.7764874461696234,9.8961930799943865,16.132695221249904,22.125613150675065,27.481287902470104,31.772239496516445,34.573162413863834,35.550000000000011,34.573162413863834,31.77223949651647,27.481287902470122,22.125613150675058,16.132695221249893,9.8961930799943971,3.7764874461696341,-1.8860090301901324,-6.7612053457669035,-10.533865361584139,-12.928257640867134,-13.750000000000007]
["azimut",{"$f":"(ASIN((SIN((B238+12)*15*PI()/180)*COS($C237*PI()/180))/COS(B239*PI()/180)))*180/PI()","v":-15.115140040184992},{"$f":"(ASIN((SIN((C238+12)*15*PI()/180)*COS($C237*PI()/180))/COS(C239*PI()/180)))*180/PI()","v":-29.960025219485299},-44.363846538545168,{"$f":"(ASIN((SIN((E238+12)*15*PI()/180)*COS($C237*PI()/180))/COS(E239*PI()/180)))*180/PI()","v":-58.305562226950769},{"$f":"(ASIN((SIN((F238+12)*15*PI()/180)*COS($C237*PI()/180))/COS(F239*PI()/180)))*180/PI()","v":-71.908784352280449},-85.408099636752326,{"$f":"(ASIN((SIN((H238+12)*15*PI()/180)*COS($C237*PI()/180))/COS(H239*PI()/180)))*180/PI()","v":-80.888349960728263},-66.635797169636987,-51.505163711509411,-35.276460814830664,-17.978368237555308,-1.694412405509663E-14,17.97836823755528,35.276460814830585,51.505163711509319,66.635797169637016,80.888349960728263,85.408099636752425,71.908784352280449,58.305562226950862,44.363846538545147,29.960025219485278,15.11514004018502,2.1288920137989795E-14,"Summa"]
["direktstr, IDN",null,null,null,null,{"$f":"1071*EXP(-0.129/SIN(F239*PI()/180))","v":151.07545382744988},505.60363478182575,673.23219264015427,760.3999198449884,809.81018611502998,838.28176296074628,853.22093188452084,857.88913414716876,853.22093188452084,838.28176296074639,809.81018611503009,760.39991984498829,673.23219264015393,505.60363478182609,151.07545382745076,null,null,null,null,null,{"$f":"SUM(B241:Y241)","v":10041.137298256601}]
["andel,%",null,null,null,null,{"$f":"F241/$Z241","v":1.5045651636859945E-2},{"$f":"G241/$Z241","v":5.0353223919128318E-2},{"$f":"H241/$Z241","v":6.7047404356979035E-2},{"$f":"I241/$Z241","v":7.5728465537167125E-2},{"$f":"J241/$Z241","v":8.0649249388874883E-2},{"$f":"K241/$Z241","v":8.3484742620369659E-2},{"$f":"L241/$Z241","v":8.4972539119912427E-2},{"$f":"M241/$Z241","v":8.5437446841417089E-2},{"$f":"N241/$Z241","v":8.4972539119912427E-2},{"$f":"O241/$Z241","v":8.3484742620369673E-2},{"$f":"P241/$Z241","v":8.0649249388874897E-2},{"$f":"Q241/$Z241","v":7.5728465537167111E-2},{"$f":"R241/$Z241","v":6.7047404356978993E-2},{"$f":"S241/$Z241","v":5.0353223919128352E-2},{"$f":"T241/$Z241","v":1.5045651636860034E-2},null,null,null,null,null,{"$f":"SUM(B242:Y242)","v":0.99999999999999978}]
["Uppmätt IDN förd",null,null,null,null,{"$f":"F242*$K11","v":1986.5550758885252},6648.3961597805664,8852.6150056671668,9998.8203391305851,10648.536840209996,11022.92165302021,11219.363107294948,11280.747274379624,11219.363107294948,11022.921653020212,10648.536840209998,9998.8203391305833,8852.6150056671613,6648.396159780571,1986.555075888537,null,null,null,null,null,132035.16363636366]
["Direktstr, IDH",null,null,null,null,{"$f":"F243*SIN(F239*PI()/180)","v":130.84330892840313},{"$f":"G243*SIN(G239*PI()/180)","v":1142.617604051203},{"$f":"H243*SIN(H239*PI()/180)","v":2459.812980856138},{"$f":"I243*SIN(I239*PI()/180)","v":3765.9398459830172},{"$f":"J243*SIN(J239*PI()/180)","v":4913.8621158135611},{"$f":"K243*SIN(K239*PI()/180)","v":5804.0527109486056},{"$f":"L243*SIN(L239*PI()/180)","v":6366.5187212328456},{"$f":"M243*SIN(M239*PI()/180)","v":6558.7751943043095},{"$f":"N243*SIN(N239*PI()/180)","v":6366.5187212328456},{"$f":"O243*SIN(O239*PI()/180)","v":5804.0527109486102},{"$f":"P243*SIN(P239*PI()/180)","v":4913.8621158135647},{"$f":"Q243*SIN(Q239*PI()/180)","v":3765.9398459830149},{"$f":"R243*SIN(R239*PI()/180)","v":2459.8129808561348},{"$f":"S243*SIN(S239*PI()/180)","v":1142.6176040512048},{"$f":"T243*SIN(T239*PI()/180)","v":130.8433089284043},null,null,null,null,null,55726.069769931863]
["Global IdH",null,null,null,null,{"$f":"244*SIN(F239*PI()/180)","v":16.070919838077455},{"$f":"244*SIN(G239*PI()/180)","v":41.934729623226211},67.798539408375049,91.899773298632468,112.59597203354974,128.47672387142779,138.45978181869853,141.86481697403872,138.45978181869853,128.47672387142785,112.59597203354981,91.899773298632425,67.798539408374992,41.934729623226254,16.070919838077504,null,null,null,null,null,1336.3376967580134]
["andel,%",null,null,null,null,{"$f":"F245/$Z245","v":1.2026091815763248E-2},{"$f":"G245/$Z245","v":3.1380338760899171E-2},5.0734585706035153E-2,6.8769872706265389E-2,8.4257124757245283E-2,9.614091122559465E-2,0.10361137170238123,0.10615940665163161,0.10361137170238123,9.6140911225594691E-2,8.4257124757245325E-2,6.8769872706265361E-2,5.0734585706035111E-2,3.1380338760899205E-2,1.2026091815763286E-2,null,null,null,null,null,0.99999999999999978]
["Global IDH + IdH förd",null,null,null,null,{"$f":"F246*$T11","v":1416.7801014735337},{"$f":"G246*$T11","v":3696.8817646698594},5976.983427866192,8101.6999307618435,9926.2353549445252,11326.250626443538,12206.337018140855,12506.518096853828,12206.337018140855,11326.250626443543,9926.2353549445306,8101.6999307618398,5976.9834278661874,3696.8817646698635,1416.7801014735383,null,null,null,null,null,117808.85454545452,null,{"$f":"Z244+Z248","v":117808.85454545455}]
["Diffusstrål IdH",null,null,null,null,{"$f":"F247-F244","v":1285.9367925451306},{"$f":"G247-G244","v":2554.2641606186562},3517.170447010054,4335.7600847788262,5012.3732391309641,5522.1979154949322,5839.8182969080099,5947.7429025495185,5839.8182969080099,5522.1979154949331,5012.3732391309659,4335.7600847788253,3517.1704470100526,2554.2641606186589,1285.936792545134,null,null,null,null,null,62082.784775522683]
[]
["September","deklination",0]
["Kl",1,2,3,4,5,6,7,8,9,10,11,12,13,14,15,16,17,18,19,20,21,22,23,24]
["solhöjd",{"$f":"ASIN(SIN($C$145*PI()/180)*SIN($C250*PI()/180)+COS($C$145*PI()/180)*COS($C250*PI()/180)*COS((B251+12)*15*PI()/180))*180/PI()","v":-23.757258135451785},-21.173711278102747,-17.152495552862863,-12.036633167999211,-6.1969663571147153,-4.3915296665422253E-15,6.196966357114726,12.036633167999202,17.152495552862849,21.173711278102743,23.757258135451778,24.650000000000006,23.757258135451785,21.173711278102754,17.152495552862877,12.03663316799919,6.1969663571147162,7.3192161109037093E-15,-6.1969663571147047,-12.036633167999179,-17.152495552862863,-21.173711278102754,-23.757258135451778,-24.650000000000006]
["azimut",{"$f":"(ASIN((SIN((B251+12)*15*PI()/180)*COS($C250*PI()/180))/COS(B252*PI()/180)))*180/PI()","v":-16.426304677686925},{"$f":"(ASIN((SIN((C251+12)*15*PI()/180)*COS($C250*PI()/180))/COS(C252*PI()/180)))*180/PI()","v":-32.425260891770854},-47.733163584916227,{"$f":"(ASIN((SIN((E251+12)*15*PI()/180)*COS($C250*PI()/180))/COS(E252*PI()/180)))*180/PI()","v":-62.312306458967676},{"$f":"(ASIN((SIN((F251+12)*15*PI()/180)*COS($C250*PI()/180))/COS(F252*PI()/180)))*180/PI()","v":-76.313092528228083},-90,{"$f":"(ASIN((SIN((H251+12)*15*PI()/180)*COS($C250*PI()/180))/COS(H252*PI()/180)))*180/PI()","v":-76.313092528228026},-62.312306458967733,-47.733163584916255,-32.425260891770876,-16.42630467768695,-1.5446795136835537E-14,16.426304677686918,32.425260891770797,47.73316358491617,62.312306458967733,76.313092528228054,90,76.313092528228083,62.312306458967775,47.733163584916205,32.425260891770826,16.426304677686954,2.3170192705253306E-14,"Summa"]
["direktstr, IDN",null,null,null,null,null,0,{"$f":"1071*EXP(-0.129/SIN(H252*PI()/180))","v":324.18490771610448},576.94846401733128,691.54986697397715,749.3468859971772,777.54356240724223,786.07366382710063,777.54356240724223,749.34688599717754,691.54986697397771,576.94846401733105,324.18490771610379,0,null,null,null,null,null,null,{"$f":"SUM(B254:Y254)","v":7025.2210380507649}]
["andel,%",null,null,null,null,null,null,{"$f":"H254/$Z254","v":4.6145865868165423E-2},{"$f":"I254/$Z254","v":8.212531120265118E-2},{"$f":"J254/$Z254","v":9.8438164895927077E-2},{"$f":"K254/$Z254","v":0.106665239703987},{"$f":"L254/$Z254","v":0.11067887518354602},{"$f":"M254/$Z254","v":0.11189308629144665},{"$f":"N254/$Z254","v":0.11067887518354602},{"$f":"O254/$Z254","v":0.10666523970398704},{"$f":"P254/$Z254","v":9.8438164895927147E-2},{"$f":"Q254/$Z254","v":8.2125311202651152E-2},{"$f":"R254/$Z254","v":4.6145865868165326E-2},null,null,null,null,null,null,null,{"$f":"SUM(B255:Y255)","v":1}]
["Uppmätt IDN förd",null,null,null,null,null,null,{"$f":"H255*$K12","v":4124.8468049757757},7340.9463913774543,8799.1056689383568,9534.5003266802469,9893.2677086055173,10001.802562481673,9893.2677086055173,9534.5003266802505,8799.1056689383622,7340.9463913774516,4124.8468049757666,null,null,null,null,null,null,null,{"$f":"SUM(B256:Y256)","v":89387.136363636382}]
["Direktstr, IDH",null,null,null,null,null,null,{"$f":"H256*SIN(H252*PI()/180)","v":445.26367562221441},{"$f":"I256*SIN(I252*PI()/180)","v":1530.8592747177695},{"$f":"J256*SIN(J252*PI()/180)","v":2594.9963311943293},{"$f":"K256*SIN(K252*PI()/180)","v":3443.8306147213557},{"$f":"L256*SIN(L252*PI()/180)","v":3985.6279155093034},{"$f":"M256*SIN(M252*PI()/180)","v":4171.492720517741},{"$f":"N256*SIN(N252*PI()/180)","v":3985.6279155093043},{"$f":"O256*SIN(O252*PI()/180)","v":3443.8306147213598},{"$f":"P256*SIN(P252*PI()/180)","v":2594.9963311943357},{"$f":"Q256*SIN(Q252*PI()/180)","v":1530.8592747177677},{"$f":"R256*SIN(R252*PI()/180)","v":445.26367562221265},null,null,null,null,null,null,null,28172.648344047691]
["Global IdH",null,null,null,null,null,null,{"$f":"244*SIN(H252*PI()/180)","v":26.338999237684018},{"$f":"244*SIN(I252*PI()/180)","v":50.883039204574096},71.959484137870533,88.132009145841351,98.298483375554554,101.76607840914815,98.298483375554568,88.132009145841408,71.95948413787066,50.883039204574054,26.338999237683971,null,null,null,null,null,null,null,772.99010861219733]
["andel,%",null,null,null,null,null,null,{"$f":"H258/$Z258","v":3.4074173710931757E-2},{"$f":"I258/$Z258","v":6.5826248793697945E-2},9.3092373804193149E-2,0.11401440738235429,0.12716654751512491,0.13165249758739583,0.12716654751512493,0.11401440738235435,9.3092373804193315E-2,6.5826248793697889E-2,3.4074173710931695E-2,null,null,null,null,null,null,null,1]
["Global IDH + IdH förd",null,null,null,null,null,null,{"$f":"H259*$T12","v":2240.4912248583023},{"$f":"I259*$T12","v":4328.2966753293204},6121.1358602250966,7496.8297519018306,8361.6270850833989,8656.5933506586371,8361.6270850834007,7496.8297519018352,6121.1358602251075,4328.2966753293167,2240.4912248582982,null,null,null,null,null,null,null,65753.354545454538,null,{"$f":"Z257+Z261","v":65753.354545454538}]
["Diffusstrål IdH",null,null,null,null,null,null,{"$f":"H260-H257","v":1795.227549236088},{"$f":"I260-I257","v":2797.4374006115509},3526.1395290307673,4052.9991371804749,4375.9991695740955,4485.1006301408961,4375.9991695740964,4052.9991371804754,3526.1395290307719,2797.437400611549,1795.2275492360855,null,null,null,null,null,null,null,37580.706201406851]
[]
["Oktober","deklination",-10.9]
["Kl",1,2,3,4,5,6,7,8,9,10,11,12,13,14,15,16,17,18,19,20,21,22,23,24]
["solhöjd",{"$f":"ASIN(SIN($C$145*PI()/180)*SIN($C263*PI()/180)+COS($C$145*PI()/180)*COS($C263*PI()/180)*COS((B264+12)*15*PI()/180))*180/PI()","v":-34.573162413863834},-31.772239496516448,-27.481287902470111,-22.125613150675079,-16.132695221249886,-9.8961930799943936,-3.7764874461696119,1.8860090301901529,6.761205345766891,10.53386536158413,12.928257640867132,13.750000000000007,12.928257640867136,10.533865361584146,6.7612053457669132,1.8860090301901435,-3.7764874461696216,-9.8961930799943829,-16.132695221249879,-22.12561315067504,-27.481287902470118,-31.772239496516463,-34.573162413863834,-35.550000000000011]
["azimut",{"$f":"(ASIN((SIN((B264+12)*15*PI()/180)*COS($C263*PI()/180))/COS(B265*PI()/180)))*180/PI()","v":-17.978368237555284},{"$f":"(ASIN((SIN((C264+12)*15*PI()/180)*COS($C263*PI()/180))/COS(C265*PI()/180)))*180/PI()","v":-35.276460814830649},-51.505163711509383,{"$f":"(ASIN((SIN((E264+12)*15*PI()/180)*COS($C263*PI()/180))/COS(E265*PI()/180)))*180/PI()","v":-66.635797169636987},{"$f":"(ASIN((SIN((F264+12)*15*PI()/180)*COS($C263*PI()/180))/COS(F265*PI()/180)))*180/PI()","v":-80.888349960728263},-85.408099636752326,{"$f":"(ASIN((SIN((H264+12)*15*PI()/180)*COS($C263*PI()/180))/COS(H265*PI()/180)))*180/PI()","v":-71.908784352280406},-58.305562226950798,-44.363846538545168,-29.960025219485324,-15.115140040185008,-1.419261342532653E-14,15.115140040184988,29.960025219485242,44.363846538545104,58.305562226950826,71.908784352280435,85.408099636752425,80.888349960728306,66.635797169637044,51.505163711509354,35.276460814830621,17.978368237555319,2.5416186082644946E-14,"Summa"]
["direktstr, IDN",null,null,null,null,null,null,null,{"$f":"1071*EXP(-0.129/SIN(I265*PI()/180))","v":21.2573054062713},358.03671628171048,528.85965549071716,601.70203157097251,622.41991867441675,601.70203157097262,528.85965549071773,358.03671628171173,21.257305406270877,null,null,null,null,null,null,null,null,{"$f":"SUM(B267:Y267)","v":3642.1313361737607}]
["andel,%",null,null,null,null,null,null,null,{"$f":"I267/$Z267","v":5.836501609687462E-3},{"$f":"J267/$Z267","v":9.8304175010296521E-2},{"$f":"K267/$Z267","v":0.14520609134494047},{"$f":"L267/$Z267","v":0.16520602252720801},{"$f":"M267/$Z267","v":0.17089441901573479},{"$f":"N267/$Z267","v":0.16520602252720804},{"$f":"O267/$Z267","v":0.14520609134494061},{"$f":"P267/$Z267","v":9.8304175010296868E-2},{"$f":"Q267/$Z267","v":5.8365016096873458E-3},null,null,null,null,null,null,null,null,{"$f":"SUM(B268:Y268)","v":1}]
["Uppmätt IDN förd",null,null,null,null,null,null,null,{"$f":"I268*$K13","v":268.87558474134318},4528.6704786541122,6689.3449756910868,7610.700532672894,7872.7532201174781,7610.700532672895,6689.3449756910932,4528.6704786541286,268.87558474133783,null,null,null,null,null,null,null,null,46067.936363636378]
["Direktstr, IDH",null,null,null,null,null,null,null,{"$f":"I269*SIN(I265*PI()/180)","v":8.8489974853956195},{"$f":"J269*SIN(J265*PI()/180)","v":533.16766562953853},{"$f":"K269*SIN(K265*PI()/180)","v":1222.9236946655806},{"$f":"L269*SIN(L265*PI()/180)","v":1702.7483486859771},{"$f":"M269*SIN(M265*PI()/180)","v":1871.2423741873765},{"$f":"N269*SIN(N265*PI()/180)","v":1702.7483486859778},{"$f":"O269*SIN(O265*PI()/180)","v":1222.9236946655835},{"$f":"P269*SIN(P265*PI()/180)","v":533.16766562954228},{"$f":"Q269*SIN(Q265*PI()/180)","v":8.8489974853953992},null,null,null,null,null,null,null,null,8806.6197871203658]
["Global IdH",null,null,null,null,null,null,null,{"$f":"244*SIN(I265*PI()/180)","v":8.0303140521800316},{"$f":"244*SIN(J265*PI()/180)","v":28.726512787097299},44.607264624975357,54.590322572246087,57.995357727586267,54.590322572246102,44.607264624975429,28.726512787097395,8.0303140521799907,null,null,null,null,null,null,null,null,329.904185800584]
["andel,%",null,null,null,null,null,null,null,{"$f":"I271/$Z271","v":2.4341352422348733E-2},{"$f":"J271/$Z271","v":8.7075320724974106E-2},0.13521278766659525,0.16547326442606614,0.17579454952003098,0.16547326442606616,0.13521278766659547,8.7075320724974398E-2,2.4341352422348608E-2,null,null,null,null,null,null,null,null,0.99999999999999989]
["Global IDH + IdH förd",null,null,null,null,null,null,null,{"$f":"I272*$T13","v":592.66258492428096},{"$f":"J272*$T13","v":2120.1075342301951},3292.1572664847795,4028.9385293386467,4280.2408973169095,4028.9385293386476,3292.1572664847849,2120.1075342302024,592.66258492427789,null,null,null,null,null,null,null,null,24347.972727272721,null,{"$f":"Z270+Z274","v":24347.972727272721}]
["Diffusstrål IdH",null,null,null,null,null,null,null,{"$f":"I273-I270","v":583.81358743888529},{"$f":"J273-J270","v":1586.9398686006566},2069.2335718191989,2326.1901806526694,2408.9985231295332,2326.1901806526698,2069.2335718192016,1586.9398686006602,583.81358743888245,null,null,null,null,null,null,null,null,15541.352940152356]
[]
["November","deklination",-19.899999999999999]
["Kl",1,2,3,4,5,6,7,8,9,10,11,12,13,14,15,16,17,18,19,20,21,22,23,24]
["solhöjd",{"$f":"ASIN(SIN($C$145*PI()/180)*SIN($C276*PI()/180)+COS($C$145*PI()/180)*COS($C276*PI()/180)*COS((B277+12)*15*PI()/180))*180/PI()","v":-43.485309064729677},-40.465543084494513,-35.920882040456689,-30.360997672174953,-24.259035180587468,-18.020762313854387,-11.997006842981127,-6.5042377559299327,-1.8369694311894287,1.7344600145682418,3.9821303036876587,4.7500000000000062,3.9821303036876587,1.7344600145682576,-1.8369694311894067,-6.5042377559299416,-11.997006842981136,-18.02076231385438,-24.25903518058746,-30.360997672174921,-35.920882040456696,-40.46554308449452,-43.485309064729677,-44.550000000000004]
["azimut",{"$f":"(ASIN((SIN((B277+12)*15*PI()/180)*COS($C276*PI()/180))/COS(B278*PI()/180)))*180/PI()","v":-19.598097612486537},{"$f":"(ASIN((SIN((C277+12)*15*PI()/180)*COS($C276*PI()/180))/COS(C278*PI()/180)))*180/PI()","v":-38.167537823852108},-55.186934613298192,{"$f":"(ASIN((SIN((E277+12)*15*PI()/180)*COS($C276*PI()/180))/COS(E278*PI()/180)))*180/PI()","v":-70.689407742830738},{"$f":"(ASIN((SIN((F277+12)*15*PI()/180)*COS($C276*PI()/180))/COS(F278*PI()/180)))*180/PI()","v":-85.014879600068582},-81.414400073356092,{"$f":"(ASIN((SIN((H277+12)*15*PI()/180)*COS($C276*PI()/180))/COS(H278*PI()/180)))*180/PI()","v":-68.206675827324545},-55.043642600789816,-41.699664340767399,-28.057639201823172,-14.119993602472398,-1.3246356762201556E-14,14.11999360247237,28.0576392018231,41.699664340767335,55.043642600789838,68.206675827324574,81.414400073356092,85.014879600068511,70.689407742830866,55.186934613298156,38.167537823852079,19.598097612486569,2.7785886881817923E-14,"Summa"]
["direktstr, IDN",null,null,null,null,null,null,null,null,null,{"$f":"1071*EXP(-0.129/SIN(K278*PI()/180))","v":15.094627180954896},167.13003481038933,225.54765653857069,167.13003481038933,15.094627180955486,null,null,null,null,null,null,null,null,null,null,{"$f":"SUM(B280:Y280)","v":589.99698052125973}]
["andel,%",null,null,null,null,null,null,null,null,null,{"$f":"K280/$Z280","v":2.558424480006467E-2},{"$f":"L280/$Z280","v":0.28327269516316961},{"$f":"M280/$Z280","v":0.38228612007353041},{"$f":"N280/$Z280","v":0.28327269516316961},{"$f":"O280/$Z280","v":2.5584244800065672E-2},null,null,null,null,null,null,null,null,null,null,{"$f":"SUM(B281:Y281)","v":1}]
["Uppmätt IDN förd",null,null,null,null,null,null,null,null,null,{"$f":"K281*$K14","v":399.72475199555583},{"$f":"L281*$K14","v":4425.8139611345669},{"$f":"M281*$K14","v":5972.7862101033743},{"$f":"N281*$K14","v":4425.8139611345669},{"$f":"O281*$K14","v":399.72475199557152},null,null,null,null,null,null,null,null,null,null,15623.863636363634]
["Direktstr, IDH",null,null,null,null,null,null,null,null,null,{"$f":"K282*SIN(K278*PI()/180)","v":12.098634826399563},{"$f":"L282*SIN(L278*PI()/180)","v":307.35217768366414},{"$f":"M282*SIN(M278*PI()/180)","v":494.59571991227335},{"$f":"N282*SIN(N278*PI()/180)","v":307.35217768366414},{"$f":"O282*SIN(O278*PI()/180)","v":12.098634826400149},null,null,null,null,null,null,null,null,null,null,1133.4973449324016]
["Global IdH",null,null,null,null,null,null,null,null,null,{"$f":"244*SIN(K278*PI()/180)","v":7.385249181852803},{"$f":"244*SIN(L278*PI()/180)","v":16.94466419360953},20.205202632977883,16.94466419360953,7.3852491818528705,null,null,null,null,null,null,null,null,null,null,68.865029383902609]
["andel,%",null,null,null,null,null,null,null,null,null,{"$f":"K284/$Z284","v":0.1072423732034176},{"$f":"L284/$Z284","v":0.24605615281375878},0.29340294796564637,0.24605615281375878,0.10724237320341859,null,null,null,null,null,null,null,null,null,null,1.0000000000000002]
["Global IDH + IdH förd",null,null,null,null,null,null,null,null,null,{"$f":"K285*$T14","v":539.90295351661655},{"$f":"L285*$T14","v":1238.7495694738202},1477.1131358373038,1238.7495694738202,539.90295351662144,null,null,null,null,null,null,null,null,null,null,5034.4181818181823,null,{"$f":"Z283+Z287","v":5034.4181818181823}]
["Diffusstrål IdH",null,null,null,null,null,null,null,null,null,{"$f":"K286-K283","v":527.80431869021697},{"$f":"L286-L283","v":931.39739179015601},982.51741592503049,931.39739179015601,527.80431869022129,null,null,null,null,null,null,null,null,null,null,3900.9208368857808]
[]
["December","deklination",-23.45]
["Kl",1,2,3,4,5,6,7,8,9,10,11,12,13,14,15,16,17,18,19,20,21,22,23,24]
["solhöjd",{"$f":"ASIN(SIN($C$145*PI()/180)*SIN($C289*PI()/180)+COS($C$145*PI()/180)*COS($C289*PI()/180)*COS((B290+12)*15*PI()/180))*180/PI()","v":-46.993291785372186},-43.871970822014767,-39.215779195001694,-33.572936168515959,-27.433300838266046,-21.203686909907983,-15.227564706949664,-9.8093946398218819,-5.2284130163218272,-1.7374671882333692,0.4529119024418391,1.2000000000000113,0.45291190244184226,-1.737467188233353,-5.228413016321805,-9.8093946398218925,-15.227564706949675,-21.203686909907972,-27.433300838266028,-33.57293616851593,-39.215779195001694,-43.871970822014767,-46.993291785372186,-48.100000000000016]
["azimut",{"$f":"(ASIN((SIN((B290+12)*15*PI()/180)*COS($C289*PI()/180))/COS(B291*PI()/180)))*180/PI()","v":-20.371966506582289},-39.516613153234616,-56.854735692322379,-72.472135006203345,-86.781461856411596,-79.745178438869488,-66.692170237711011,-53.734663486271565,-40.648411939733954,-27.31710607353207,-13.736086216720146,-1.2882465372276853E-14,13.736086216720121,27.317106073531995,40.648411939733876,53.734663486271586,66.692170237711011,79.745178438869459,86.781461856411596,72.472135006203473,56.854735692322336,39.51661315323458,20.371966506582329,2.8928598783982996E-14,"Summa"]
["direktstr, IDN",null,null,null,null,null,null,null,null,null,null,{"$f":"1071*EXP(-0.129/SIN(L291*PI()/180))","v":8.7575239423478711E-5},2.2627965386254134,8.7575239423488672E-5,null,null,null,null,null,null,null,null,null,null,null,{"$f":"SUM(B293:Y293)","v":2.2629716891042602}]
["andel,%",null,null,null,null,null,null,null,null,null,null,{"$f":"L293/$Z293","v":3.8699220076475256E-5},{"$f":"M293/$Z293","v":0.99992260155984714},{"$f":"N293/$Z293","v":3.869922007647966E-5},null,null,null,null,null,null,null,null,null,null,null,{"$f":"SUM(B294:Y294)","v":1}]
["Uppmätt IDN förd",null,null,null,null,null,null,null,null,null,null,{"$f":"L294*$K15","v":0.25314778183043846},{"$f":"M294*$K15","v":6540.911886254522},{"$f":"N294*$K15","v":0.25314778183046727},null,null,null,null,null,null,null,null,null,null,null,6541.4181818181823]
["Direktstr, IDH",null,null,null,null,null,null,null,null,null,null,{"$f":"L295*SIN(L291*PI()/180)","v":2.0010627380587379E-3},{"$f":"M295*SIN(M291*PI()/180)","v":136.98252314198385},{"$f":"N295*SIN(N291*PI()/180)","v":2.0010627380589799E-3},null,null,null,null,null,null,null,null,null,null,null,136.98652526745997]
["Global IdH",null,null,null,null,null,null,null,null,null,null,{"$f":"244*SIN(L291*PI()/180)","v":1.9287520694665785},{"$f":"244*SIN(M291*PI()/180)","v":5.1099504515391461},1.9287520694665921,null,null,null,null,null,null,null,null,null,null,null,8.9674545904723164]
["andel,%",null,null,null,null,null,null,null,null,null,null,{"$f":"L297/$Z297","v":0.21508356133922626},{"$f":"M297/$Z297","v":0.56983287732154597},0.21508356133922776,null,null,null,null,null,null,null,null,null,null,null,1]
["Global IDH + IdH förd",null,null,null,null,null,null,null,null,null,null,{"$f":"L298*$T15","v":197.93553558518065},{"$f":"M298*$T15","v":524.40165610236443},197.93553558518204,null,null,null,null,null,null,null,null,null,null,null,920.27272727272714,null,{"$f":"Z296+Z300","v":920.27272727272702}]
["Diffusstrål IdH",null,null,null,null,null,null,null,null,null,null,{"$f":"L299-L296","v":197.93353452244259},{"$f":"M299-M296","v":387.41913296038058},197.93353452244398,null,null,null,null,null,null,null,null,null,null,null,783.28620200526711]
[]
[]
[]
[null,"§"]

{"sheet":"Deklinatio","index":2,"n_rows":373,"n_cols":4,"rows_kept":373,"cut":false,"hidden":true,"merged":[[139,1,169,1],[1,1,18,1],[19,1,46,1],[47,1,77,1],[78,1,107,1],[108,1,138,1],[354,1,372,1],[170,1,200,1],[201,1,231,1],[232,1,261,1],[262,1,292,1],[293,1,322,1],[323,1,353,1]]}
[null,null,"Day no","Declination"]
[14,"Januari","14"]
[15,null,"15"]
[16,null,"16"]
[17,null,"17"]
[18,null,"18"]
[19,null,"19"]
[20,null,"20"]
[21,null,"21",-19.923999999999999]
[22,null,"22",-19.699000000000002]
[23,null,"23",-19.468]
[24,null,"24",-19.231000000000002]
[25,null,"25",-18.988]
[26,null,"26",-18.739000000000001]
[27,null,"27",-18.484000000000002]
[28,null,"28",-18.224]
[29,null,"29",-17.957999999999998]
[30,null,"30",-17.687000000000001]
[31,null,"31",-17.411000000000001]
[1,"Februari","32",-17.129000000000001]
[2,null,"33",-16.843]
[3,null,"34",-16.550999999999998]
[4,null,"35",-16.254999999999999]
[5,null,"36",-15.954000000000001]
[6,null,"37",-15.648]
[7,null,"38",-15.337999999999999]
[8,null,"39",-15.023999999999999]
[9,null,"40",-14.706]
[10,null,"41",-14.382999999999999]
[11,null,"42",-14.057]
[12,null,"43",-13.726000000000001]
[13,null,"44",-13.391999999999999]
[14,null,"45",-13.054]
[15,null,"46",-12.712999999999999]
[16,null,"47",-12.368]
[17,null,"48",-12.02]
[18,null,"49",-11.669]
[19,null,"50",-11.315]
[20,null,"51",-10.958]
[21,null,"52",-10.598000000000001]
[22,null,"53",-10.234999999999999]
[23,null,"54",-9.8689999999999998]
[24,null,"55",-9.5009999999999994]
[25,null,"56",-9.1310000000000002]
[26,null,"57",-8.7579999999999991]
[27,null,"58",-8.3829999999999991]
[28,null,"59",-8.0060000000000002]
[1,"mars","60",-7.6269999999999998]
[2,null,"61",-7.2460000000000004]
[3,null,"62",-6.8639999999999999]
[4,null,"63",-6.48]
[5,null,"64",-6.0940000000000003]
[6,null,"65",-5.7069999999999999]
[7,null,"66",-5.319]
[8,null,"67",-4.9290000000000003]
[9,null,"68",-4.5389999999999997]
[10,null,"69",-4.1470000000000002]
[11,null,"70",-3.7549999999999999]
[12,null,"71",-3.3620000000000001]
[13,null,"72",-2.968]
[14,null,"73",-2.5739999999999998]
[15,null,"74",-2.1789999999999998]
[16,null,"75",-1.784]
[17,null,"76",-1.389]
[18,null,"77",-0.99399999999999999]
[19,null,"78",-0.59899999999999998]
[20,null,"79",-0.20300000000000001]
[21,null,"80",0.192]
[22,null,"81",0.58699999999999997]
[23,null,"82",0.98099999999999998]
[24,null,"83",1.375]
[25,null,"84",1.7689999999999999]
[26,null,"85",2.161]
[27,null,"86",2.5539999999999998]
[28,null,"87",2.9449999999999998]
[29,null,"88",3.335]
[30,null,"89",3.7240000000000002]
[31,null,"90",4.1130000000000004]
[1,"april","91",4.5]
[2,null,"92",4.8849999999999998]
[3,null,"93",5.2690000000000001]
[4,null,"94",5.6520000000000001]
[5,null,"95",6.0330000000000004]
[6,null,"96",6.4119999999999999]
[7,null,"97",6.7889999999999997]
[8,null,"98",7.1639999999999997]
[9,null,"99",7.5380000000000003]
[10,null,"100",7.9089999999999998]
[11,null,"101",8.2780000000000005]
[12,null,"102",8.6440000000000001]
[13,null,"103",9.0079999999999991]
[14,null,"104",9.3699999999999992]
[15,null,"105",9.7289999999999992]
[16,null,"106",10.085000000000001]
[17,null,"107",10.438000000000001]
[18,null,"108",10.789]
[19,null,"109",11.137]
[20,null,"110",11.481]
[21,null,"111",11.823]
[22,null,"112",12.161]
[23,null,"113",12.496]
[24,null,"114",12.827999999999999]
[25,null,"115",13.156000000000001]
[26,null,"116",13.48]
[27,null,"117",13.801]
[28,null,"118",14.118]
[29,null,"119",14.430999999999999]
[30,null,"120",14.74]
[1,"maj","121",15.045]
[2,null,"122",15.346]
[3,null,"123",15.643000000000001]
[4,null,"124",15.935]
[5,null,"125",16.222999999999999]
[6,null,"126",16.507000000000001]
[7,null,"127",16.786000000000001]
[8,null,"128",17.059999999999999]
[9,null,"129",17.329999999999998]
[10,null,"130",17.594000000000001]
[11,null,"131",17.853999999999999]
[12,null,"132",18.109000000000002]
[13,null,"133",18.358000000000001]
[14,null,"134",18.603000000000002]
[15,null,"135",18.841999999999999]
[16,null,"136",19.076000000000001]
[17,null,"137",19.303999999999998]
[18,null,"138",19.527000000000001]
[19,null,"139",19.745000000000001]
[20,null,"140",19.957000000000001]
[21,null,"141",20.163]
[22,null,"142",20.363]
[23,null,"143",20.558]
[24,null,"144",20.747]
[25,null,"145",20.93]
[26,null,"146",21.106999999999999]
[27,null,"147",21.277999999999999]
[28,null,"148",21.442]
[29,null,"149",21.600999999999999]
[30,null,"150",21.753]
[31,null,"151",21.899000000000001]
[1,"juni","152",22.039000000000001]
[2,null,"153",22.172000000000001]
[3,null,"154",22.298999999999999]
[4,null,"155",22.419]
[5,null,"156",22.533000000000001]
[6,null,"157",22.64]
[7,null,"158",22.74]
[8,null,"159",22.834]
[9,null,"160",22.920999999999999]
[10,null,"161",23.001999999999999]
[11,null,"162",23.074999999999999]
[12,null,"163",23.141999999999999]
[13,null,"164",23.202999999999999]
[14,null,"165",23.256]
[15,null,"166",23.302]
[16,null,"167",23.341999999999999]
[17,null,"168",23.375]
[18,null,"169",23.401]
[19,null,"170",23.42]
[20,null,"171",23.431999999999999]
[21,null,"172",23.437000000000001]
[22,null,"173",23.436]
[23,null,"174",23.427]
[24,null,"175",23.411999999999999]
[25,null,"176",23.388999999999999]
[26,null,"177",23.36]
[27,null,"178",23.324000000000002]
[28,null,"179",23.280999999999999]
[29,null,"180",23.231999999999999]
[30,null,"181",23.175000000000001]
[31,null,"182",23.111999999999998]
[1,"juli","183",23.042000000000002]
[2,null,"184",22.965]
[3,null,"185",22.882000000000001]
[4,null,"186",22.792000000000002]
[5,null,"187",22.695]
[6,null,"188",22.591999999999999]
[7,null,"189",22.481999999999999]
[8,null,"190",22.366]
[9,null,"191",22.244]
[10,null,"192",22.114999999999998]
[11,null,"193",21.98]
[12,null,"194",21.838000000000001]
[13,null,"195",21.690999999999999]
[14,null,"196",21.536999999999999]
[15,null,"197",21.376999999999999]
[16,null,"198",21.210999999999999]
[17,null,"199",21.039000000000001]
[18,null,"200",20.861000000000001]
[19,null,"201",20.677]
[20,null,"202",20.488]
[21,null,"203",20.292000000000002]
[22,null,"204",20.091000000000001]
[23,null,"205",19.885000000000002]
[24,null,"206",19.672000000000001]
[25,null,"207",19.454999999999998]
[26,null,"208",19.231999999999999]
[27,null,"209",19.003]
[28,null,"210",18.77]
[29,null,"211",18.530999999999999]
[30,null,"212",18.286999999999999]
[31,null,"213",18.038]
[1,"augusti","214",17.785]
[2,null,"215",17.526]
[3,null,"216",17.263000000000002]
[4,null,"217",16.995000000000001]
[5,null,"218",16.722999999999999]
[6,null,"219",16.446000000000002]
[7,null,"220",16.164999999999999]
[8,null,"221",15.879]
[9,null,"222",15.59]
[10,null,"223",15.295999999999999]
[11,null,"224",14.997999999999999]
[12,null,"225",14.696]
[13,null,"226",14.39]
[14,null,"227",14.081]
[15,null,"228",13.766999999999999]
[16,null,"229",13.45]
[17,null,"230",13.13]
[18,null,"231",12.805]
[19,null,"232",12.478]
[20,null,"233",12.147]
[21,null,"234",11.813000000000001]
[22,null,"235",11.476000000000001]
[23,null,"236",11.135999999999999]
[24,null,"237",10.792]
[25,null,"238",10.446]
[26,null,"239",10.098000000000001]
[27,null,"240",9.7460000000000004]
[28,null,"241",9.3919999999999995]
[29,null,"242",9.0350000000000001]
[30,null,"243",8.6760000000000002]
[31,null,"244",8.3149999999999995]
[1,"september","245",7.952]
[2,null,"246",7.5860000000000003]
[3,null,"247",7.2190000000000003]
[4,null,"248",6.8490000000000002]
[5,null,"249",6.4779999999999998]
[6,null,"250",6.1050000000000004]
[7,null,"251",5.73]
[8,null,"252",5.3540000000000001]
[9,null,"253",4.976]
[10,null,"254",4.5970000000000004]
[11,null,"255",4.2160000000000002]
[12,null,"256",3.835]
[13,null,"257",3.452]
[14,null,"258",3.0680000000000001]
[15,null,"259",2.6829999999999998]
[16,null,"260",2.2970000000000002]
[17,null,"261",1.911]
[18,null,"262",1.5229999999999999]
[19,null,"263",1.135]
[20,null,"264",0.747]
[21,null,"265",0.35799999999999998]
[22,null,"266",-3.1E-2]
[23,null,"267",-0.42099999999999999]
[24,null,"268",-0.81]
[25,null,"269",-1.2]
[26,null,"270",-1.589]
[27,null,"271",-1.9790000000000001]
[28,null,"272",-2.3679999999999999]
[29,null,"273",-2.7570000000000001]
[30,null,"274",-3.145]
[1,"oktober","275",-3.532]
[2,null,"276",-3.919]
[3,null,"277",-4.3049999999999997]
[4,null,"278",-4.6909999999999998]
[5,null,"279",-5.0750000000000002]
[6,null,"280",-5.4580000000000002]
[7,null,"281",-5.84]
[8,null,"282",-6.2210000000000001]
[9,null,"283",-6.6]
[10,null,"284",-6.9779999999999998]
[11,null,"285",-7.3540000000000001]
[12,null,"286",-7.7290000000000001]
[13,null,"287",-8.1020000000000003]
[14,null,"288",-8.4730000000000008]
[15,null,"289",-8.8420000000000005]
[16,null,"290",-9.2089999999999996]
[17,null,"291",-9.5739999999999998]
[18,null,"292",-9.9359999999999999]
[19,null,"293",-10.297000000000001]
[20,null,"294",-10.654]
[21,null,"295",-11.009]
[22,null,"296",-11.362]
[23,null,"297",-11.711]
[24,null,"298",-12.058]
[25,null,"299",-12.401]
[26,null,"300",-12.741]
[27,null,"301",-13.077999999999999]
[28,null,"302",-13.412000000000001]
[29,null,"303",-13.742000000000001]
[30,null,"304",-14.068]
[31,null,"305",-14.391]
[1,"november","306",-14.71]
[2,null,"307",-15.023999999999999]
[3,null,"308",-15.335000000000001]
[4,null,"309",-15.641999999999999]
[5,null,"310",-15.944000000000001]
[6,null,"311",-16.241]
[7,null,"312",-16.535]
[8,null,"313",-16.823]
[9,null,"314",-17.106999999999999]
[10,null,"315",-17.385999999999999]
[11,null,"316",-17.66]
[12,null,"317",-17.928999999999998]
[13,null,"318",-18.192]
[14,null,"319",-18.451000000000001]
[15,null,"320",-18.704000000000001]
[16,null,"321",-18.951000000000001]
[17,null,"322",-19.193000000000001]
[18,null,"323",-19.428999999999998]
[19,null,"324",-19.66]
[20,null,"325",-19.884]
[21,null,"326",-20.103000000000002]
[22,null,"327",-20.315000000000001]
[23,null,"328",-20.521000000000001]
[24,null,"329",-20.721]
[25,null,"330",-20.914000000000001]
[26,null,"331",-21.100999999999999]
[27,null,"332",-21.280999999999999]
[28,null,"333",-21.454000000000001]
[29,null,"334",-21.620999999999999]
[30,null,"335",-21.780999999999999]
[1,"december","336",-21.933]
[2,null,"337",-22.079000000000001]
[3,null,"338",-22.218]
[4,null,"339",-22.35]
[5,null,"340",-22.474]
[6,null,"341",-22.591000000000001]
[7,null,"342",-22.7]
[8,null,"343",-22.803000000000001]
[9,null,"344",-22.896999999999998]
[10,null,"345",-22.984999999999999]
[11,null,"346",-23.064]
[12,null,"347",-23.135999999999999]
[13,null,"348",-23.201000000000001]
[14,null,"349",-23.257999999999999]
[15,null,"350",-23.306999999999999]
[16,null,"351",-23.347999999999999]
[17,null,"352",-23.381]
[18,null,"353",-23.407]
[19,null,"354",-23.425000000000001]
[20,null,"355",-23.434999999999999]
[21,null,"356",-23.437000000000001]
[22,null,"357",-23.431000000000001]
[23,null,"358",-23.417000000000002]
[24,null,"359",-23.396000000000001]
[25,null,"360",-23.366]
[26,null,"361",-23.329000000000001]
[27,null,"362",-23.283999999999999]
[28,null,"363",-23.231999999999999]
[29,null,"364",-23.170999999999999]
[30,null,"365",-23.103000000000002]
[31,null,"366",-23.027000000000001]
[1,"Januari","367",-22.943999999999999]
[2,null,"368",-22.853000000000002]
[3,null,"369",-22.754000000000001]
[4,null,"370",-22.648]
[5,null,"371",-22.533999999999999]
[6,null,"372",-22.413]
[7,null,"373",-22.285]
[8,null,"374",-22.149000000000001]
[9,null,"375",-22.006]
[10,null,"376",-21.856000000000002]
[11,null,"377",-21.699000000000002]
[12,null,"378",-21.533999999999999]
[13,null,"379",-21.363]
[14,null,"380",-21.184999999999999]
[15,null,"381",-21]
[16,null,"382",-20.809000000000001]
[17,null,"383",-20.61]
[18,null,"384",-20.405999999999999]
[19,null,"385",-20.193999999999999]

{"sheet":"Sammanst","index":3,"n_rows":78,"n_cols":15,"rows_kept":78,"cut":false,"hidden":true,"merged":[]}
[null,"Lutande yta"]
[null,"Plats","Luleå"]
[null,"Period",null,null,null,null,null,null,null,null,null,null,null,null,"Model"]
[null,"kWh/m2, år"]
[null,"Orientering","Lutning",0,10,20,30,40,50,60,70,80,90]
[null,"S","Januari",3.1128818181818194,5.3647768680759187,7.5089019713042209,9.4801089715847855,11.21850374169296,12.671266036209207,13.794254407947843,14.553347423493117,14.925480425687297,14.899346341567089,null,{"$f":"'Lutande yta'!Z$27","v":20.041804418506693}]
[null,"180o","Februari",17.350136363636363,23.390823625155662,28.966876552697151,33.908869599676393,38.066642808130091,41.313864343054128,43.551869021283196,44.71265620315436,44.760955957533085,43.695300720823447,null,{"$f":"'Lutande yta'!Z$39","v":37.038866296596886}]
[null,null,"Mars",59.094309090909107,70.144307423923081,79.798885765671571,87.764694638692959,93.799696971274244,97.720522271398508,99.40803824635482,98.810970577168348,95.947460862836593,90.904515397023616,null,{"$f":"'Lutande yta'!Z$51","v":101.9730039450647}]
[null,null,"April",106.81061818181817,116.81590239733291,124.85787365562847,130.43161439779502,133.36776933183066,133.57712487583083,131.05331986753009,125.8730388449987,118.19368202575764,108.2485827808174,null,{"$f":"'Lutande yta'!Z$63","v":144.73780950385432}]
[null,null,"Maj",160.5246727272727,167.72600909293624,171.0933026652236,172.8949936185461,170.74811401122582,164.7178956937577,154.98756379828026,141.85276953565204,125.71260698301641,107.05748681221895,null,{"$f":"'Lutande yta'!Z$75","v":164.73380367120808}]
[null,null,"Juni",173.20248181818181,176.94849168932714,177.65890703437438,177.72947362520989,173.86409605134969,166.18022185440009,154.9113216636074,140.39979530893029,123.08656817546894,103.49769390875787,null,{"$f":"'Lutande yta'!Z$87","v":171.54254333380496}]
[null,null,"Juli",161.55701818181822,168.68791505338845,171.98742234872228,173.70743587608749,171.48573969940125,165.38983893275972,155.60495443628264,142.42839497400487,126.26052363752709,107.5925930160704,null,{"$f":"'Lutande yta'!Z$99","v":174.38787730977293}]
[null,null,"Augusti",117.80885454545452,127.59734482008788,134.90235335759124,139.24023455220834,140.47918407891456,138.58155708327968,133.60501200132049,125.70075863709896,115.10896372934178,102.15145360661428,null,{"$f":"'Lutande yta'!Z$111","v":154.68307175662784}]
[null,null,"September",65.753354545454542,75.757721877032253,84.145351609338221,90.661389857301771,95.107850096032934,97.3496288811954,97.318610898796734,95.015738614536289,90.51098363746172,83.941220668035413,null,{"$f":"'Lutande yta'!Z$123","v":116.91554828774875}]
[null,null,"Oktober",24.347972727272722,31.138167486198508,37.383628505794277,42.894590613335396,47.503606013865571,51.070632106714072,53.487286609051971,54.680140696711902,54.61295010185362,53.287756376701807,null,{"$f":"'Lutande yta'!Z$135","v":66.754330879699864}]
[null,null,"November",5.0344181818181823,7.6513919539893758,10.136630433247195,12.414620905990743,14.416147784424506,16.080395687168739,17.356797283848646,18.206569757839464,18.603893202524606,18.536695146092686,null,{"$f":"'Lutande yta'!Z$147","v":26.724028210917165}]
[null,null,"December",0.92027272727272713,0.7815012203888182,0.77620051130264256,0.76754513411003567,0.7557980780671627,0.74131627152758894,0.72453973685487194,0.70597822056570614,0.68619570493995696,0.665793271704477,null,{"$f":"'Lutande yta'!Z$159","v":17.303077039173296}]
[null,null,"Summa",{"$f":"SUM(D6:D17)","v":895.51699090909085},{"$f":"SUM(E6:E17)","v":972.00435350783619},1029.2163344108951,1071.8955717905387,1090.8131486662094,1085.3942640372957,1055.8035679711591,1002.9401587941541,928.41026444394868,834.47843804642741,null,{"$f":"SUM(O6:O17)","v":1196.8357646529755}]
[]
[null,"SO","Lutning",0,10,20,30,40,50,60,70,80,90]
[null,"135o","Januari",3.1128818181818194,4.6994498063851626,6.1984634740204427,7.5643760493340784,8.7556849699102788,9.7361929170287329,10.476107652877218,10.952947242621889,11.152223156620837,11.067880497065673,null,{"$f":"'Lutande yta'!Z$27","v":20.041804418506693}]
[null,null,"Februari",17.350136363636363,21.582181017997048,25.412405569489511,28.716571042595387,31.394282041402768,33.364177672200029,34.566403653060704,34.964430955912015,34.546165722568382,33.324316730492498,null,{"$f":"'Lutande yta'!Z$39","v":37.038866296596886}]
[null,null,"Mars",59.094309090909107,66.678336712495536,70.187287526158329,76.234378991865853,80.701006723440898,83.451454497482203,84.402151350169348,83.524210838709138,80.844308741283044,76.44387252702542,null,{"$f":"'Lutande yta'!Z$51","v":101.9730039450647}]
[null,null,"April",106.81061818181817,113.42615688251639,118.58495844225267,117.76460696006644,121.28544517729087,122.44659930996451,121.2127882773384,117.62150080330035,111.7818563404699,103.87128953084742,null,{"$f":"'Lutande yta'!Z$63","v":144.73780950385432}]
[null,null,"Maj",160.5246727272727,165.46199541723448,167.18674333558178,166.91715271973101,158.83046585161554,155.5470472424486,148.84216664479212,138.91954846277264,126.08068642876373,110.71568286889112,null,{"$f":"'Lutande yta'!Z$75","v":164.73380367120808}]
[null,null,"Juni",173.20248181818181,175.73954083257178,176.66238331690573,173.00517030772841,163.22889808046634,158.4731485377107,150.36654852387227,139.1554129782341,125.18038658124202,108.86609343826409,null,{"$f":"'Lutande yta'!Z$87","v":171.54254333380496}]
[null,null,"Juli",161.55701818181822,166.44166777456232,168.11151896617713,167.77650489438446,159.66161291260767,156.29095689005524,149.50778206427833,139.51819176990603,126.62571465305638,111.22208210701652,null,{"$f":"'Lutande yta'!Z$99","v":174.38787730977293}]
[null,null,"Augusti",117.80885454545452,124.19302533830762,128.60246819656393,126.5187662273362,128.34491284094196,127.40317662353489,123.72217175353937,117.41374370125189,108.66957086082257,97.755340499242905,null,{"$f":"'Lutande yta'!Z$111","v":154.68307175662784}]
[null,null,"September",65.753354545454542,72.566843850155649,75.296622009717041,80.046230669975898,83.048797561379558,84.213091208304888,83.503735137451088,80.942282774079558,76.606562552093919,70.628313136458857,null,{"$f":"'Lutande yta'!Z$123","v":116.91554828774875}]
[null,null,"Oktober",24.347972727272722,29.101830443545264,33.381676488577938,37.048620908513634,39.991245452716022,42.120139963449375,43.370619058277654,43.704687562677464,43.112194974189435,41.611143880299053,null,{"$f":"'Lutande yta'!Z$135","v":66.754330879699864}]
[null,null,"November",5.0344181818181823,6.8772506595346217,8.6118697358352989,10.185569887846425,11.550535032779836,12.665291395412428,13.495967667759547,14.017324171628397,14.213519753468047,14.078593109804048,null,{"$f":"'Lutande yta'!Z$147","v":26.724028210917165}]
[null,null,"December",0.92027272727272713,0.7815012203888182,0.77620051130264256,0.76754513411003567,0.7557980780671627,0.74131627152758894,0.72453973685487194,0.70597822056570614,0.68619570493995696,0.665793271704477,null,{"$f":"'Lutande yta'!Z$159","v":17.303077039173296}]
[null,null,"Summa",{"$f":"SUM(D20:D32)","v":895.51699090909085},{"$f":"SUM(E20:E32)","v":957.54977995569482},999.01259757258231,1022.5454937934879,1027.5486847226189,1036.4525925291193,1024.190981520271,991.44025948165915,939.49938546951819,870.25040159711216,null,{"$f":"SUM(O21:O32)","v":1196.8357646529755}]
[]
[null,"O","Lutning",0,10,20,30,40,50,60,70,80,90]
[null,"90o","Januari",3.1128818181818194,3.0116214579865836,3.1486390090477472,3.2452228408698165,3.2984383025966557,3.3066684693520192,3.2696632716837093,3.1885470937973435,3.0657846097112333,2.9051058953835209,null,{"$f":"'Lutande yta'!Z$27","v":20.041804418506693}]
[null,null,"Februari",17.350136363636363,17.255737470514273,16.507987604364164,17.258922353797107,17.731537486490712,17.911472830792871,17.793261142318638,17.380494223404302,16.68571378801094,15.730030388092114,null,{"$f":"'Lutande yta'!Z$39","v":37.038866296596886}]
[null,null,"Mars",59.094309090909107,58.839683329233431,58.478800774083517,56.108700377325498,57.63060372601042,58.137309638051384,57.613422110716563,56.074859201424125,53.568369365622537,50.170111028627595,null,{"$f":"'Lutande yta'!Z$51","v":101.9730039450647}]
[null,null,"April",106.81061818181817,106.05653150100403,105.2314658825441,103.92438332286316,99.498398089868587,99.755595182370257,98.307281787787034,95.197464175731326,90.520632580701886,84.418890164122601,null,{"$f":"'Lutande yta'!Z$63","v":144.73780950385432}]
[null,null,"Maj",160.5246727272727,158.90735288464808,155.58868516854642,151.75573192961681,146.80226963562598,137.25204519431685,131.97806080740014,123.9987461583402,113.55654868502074,100.96874927366177,null,{"$f":"'Lutande yta'!Z$75","v":164.73380367120808}]
[null,null,"Juni",173.20248181818181,171.19530825965961,167.365949181204,162.70358701940665,156.38697443933529,145.76137832580289,139.69308146021234,130.84455695851631,119.48466276012954,105.95856350188605,null,{"$f":"'Lutande yta'!Z$87","v":171.54254333380496}]
[null,null,"Juli",161.55701818181822,159.93846149514943,156.60447425307692,152.73406033742913,147.72780557331279,138.13952123055253,132.77601394219027,124.7144774929392,114.19985758847544,101.55163563394173,null,{"$f":"'Lutande yta'!Z$99","v":174.38787730977293}]
[null,null,"Augusti",117.80885454545452,116.79171478267928,115.19156325631944,112.61903754434745,106.46419391204864,104.61461415621108,100.71818468678572,94.893296541512555,87.316935999150104,78.219306940954652,null,{"$f":"'Lutande yta'!Z$111","v":154.68307175662784}]
[null,null,"September",65.753354545454542,65.350341195217922,64.517433085242871,61.517918974962228,61.809483059102767,60.908119722304924,58.841216433445489,55.671575003052894,51.495503382073665,46.439889393517063,null,{"$f":"'Lutande yta'!Z$123","v":116.91554828774875}]
[null,null,"Oktober",24.347972727272722,24.230720350364376,23.356259596438086,24.148540840532998,24.608464614004696,24.722056365728918,24.485864667809714,23.907066085469591,23.003247120746735,21.801869855529798,null,{"$f":"'Lutande yta'!Z$135","v":66.754330879699864}]
[null,null,"November",5.0344181818181823,4.9133780054954608,5.0632465170925052,5.1600192252115065,5.2007557400856195,5.1842183033240641,5.1109093965744972,4.983056473872403,4.8045442815773871,4.5807968223208055,null,{"$f":"'Lutande yta'!Z$147","v":26.724028210917165}]
[null,null,"December",0.92027272727272713,0.91641507952402934,0.90494441602822639,0.88620726602846467,0.86077294834603113,0.82941427185332095,0.79308405406730953,0.75288617027144711,0.71004201282376056,0.66585337976810777,null,{"$f":"'Lutande yta'!Z$159","v":17.303077039173296}]
[null,null,"Summa",{"$f":"SUM(D36:D47)","v":895.51699090909085},{"$f":"SUM(E36:E47)","v":887.40726581147658},871.95944874398788,852.06233203239071,828.01969752682805,796.5224136906611,771.38004376099127,731.60702557833179,678.41184217404407,613.41080227780594,null,{"$f":"SUM(O36:O47)","v":1196.8357646529755}]
[]
[null,"NO","Lutning",0,10,20,30,40,50,60,70,80,90]
[null,"45o","Januari",3.1128818181818194,2.1338364531986902,2.1193632240074991,2.0957302994669846,2.0636557540304725,2.0241141565305494,1.978306958398236,1.9276259881692224,1.8736111614781081,1.817903691501082,null,{"$f":"'Lutande yta'!Z$27","v":20.041804418506693}]
[null,null,"Februari",17.350136363636363,12.639944123062543,9.468214564748461,9.3710258176729404,9.2351871986399612,9.0648260953511901,8.8651188437231774,8.6421334475398908,8.4026452052283087,8.1539308458441671,null,{"$f":"'Lutande yta'!Z$39","v":37.038866296596886}]
[null,null,"Mars",59.094309090909107,50.56080380331327,43.165675565227318,34.755790471310036,34.556146267987387,34.042410341643915,33.230192298438659,32.144170972612237,30.817344572596575,29.290028047149594,null,{"$f":"'Lutande yta'!Z$51","v":101.9730039450647}]
[null,null,"April",106.81061818181817,97.834823800799072,88.524615643959905,80.545741641437729,68.900392063294603,68.328357767131806,67.005713689796593,64.972647702288697,62.290933485857444,59.042053569956238,null,{"$f":"'Lutande yta'!Z$63","v":144.73780950385432}]
[null,null,"Maj",160.5246727272727,151.9228654615342,139.75926713077925,127.44203965665879,116.30792537520131,99.879975993371858,95.571718814008435,89.664319651473036,82.337271840031136,73.813204019768406,null,{"$f":"'Lutande yta'!Z$75","v":164.73380367120808}]
[null,null,"Juni",173.20248181818181,165.63164790035418,154.85716021750639,142.4898803843756,130.81041025105205,112.12794200353457,107.42384932125877,100.92001329240033,92.814049683596281,83.352254097284558,null,{"$f":"'Lutande yta'!Z$87","v":171.54254333380496}]
[null,null,"Juli",161.55701818181822,153.00878344746621,140.89927442396592,128.61116492717059,117.47275961236689,101.06072190717607,96.655363474245334,90.649483566963212,83.225567807190558,74.609188118605374,null,{"$f":"'Lutande yta'!Z$99","v":174.38787730977293}]
[null,null,"Augusti",117.80885454545452,108.53465844173265,98.412883117118184,89.139881075002265,75.734633959954209,73.052257594756099,69.282037748766939,64.538530644183794,58.965865344049,52.733364463602456,null,{"$f":"'Lutande yta'!Z$111","v":154.68307175662784}]
[null,null,"September",65.753354545454542,57.72855296737194,50.4197043910426,41.859780836536295,40.566435897120257,38.725622775282176,36.393273646232686,33.640255758032367,30.550218166119922,27.217050099091118,null,{"$f":"'Lutande yta'!Z$123","v":116.91554828774875}]
[null,null,"Oktober",24.347972727272722,19.033833504148376,15.430232333947565,15.267617742984145,15.042488035752616,14.761683664486076,14.433736727911599,14.068611727747836,13.677402802362602,13.271996636992453,null,{"$f":"'Lutande yta'!Z$135","v":66.754330879699864}]
[null,null,"November",5.0344181818181823,3.8920312739607117,3.8656326900566471,3.8225271927871844,3.764024520874421,3.6919022484006474,3.6083517741193472,3.5159117369129782,3.4173908805351392,3.3157827113529135,null,{"$f":"'Lutande yta'!Z$147","v":26.724028210917165}]
[null,null,"December",0.92027272727272713,1.7194350632465276,2.4865830265527946,3.198407214522069,3.833279209403321,4.3719087468928173,4.7979298410536346,5.0983980565167739,5.2641838185996388,5.290249810812985,null,{"$f":"'Lutande yta'!Z$159","v":17.303077039173296}]
[null,null,"Summa",{"$f":"SUM(D51:D62)","v":895.51699090909085},{"$f":"SUM(E51:E62)","v":824.64121624018844},749.40860632891247,678.59958725992465,618.2873381456775,561.13172329455779,539.24559313795339,509.78210254484043,473.63648476764473,431.90700611196149,null,{"$f":"SUM(O51:O62)","v":1196.8357646529755}]
[]
[null,"N","Lutning",0,10,20,30,40,50,60,70,80,90]
[null,"0o","Januari",3.1128818181818194,2.1338364531986902,2.1193632240074991,2.0957302994669846,2.0636557540304725,2.0241141565305494,1.978306958398236,1.9276259881692224,1.8736111614781081,1.817903691501082,null,{"$f":"'Lutande yta'!Z$27","v":20.041804418506693}]
[null,null,"Februari",17.350136363636363,11.115453319888509,9.4420414309115994,9.3367536491300474,9.1938573378896642,9.0176943292984628,8.8136172472297094,8.587826870554073,8.3471837256113979,8.0989996325894609,null,{"$f":"'Lutande yta'!Z$39","v":37.038866296596886}]
[null,null,"Mars",59.094309090909107,46.398067585122945,32.253021468269601,27.920236743682995,27.492925604334012,26.966135127667197,26.355871575747255,25.680677497790988,24.961068324192428,24.218909015551521,null,{"$f":"'Lutande yta'!Z$51","v":101.9730039450647}]
[null,null,"April",106.81061818181817,92.547417743587459,75.517556345780875,56.420184309314038,50.015788533701553,49.1263871340443,48.069818114235076,46.878184789291062,45.587694334795103,44.237557650187398,null,{"$f":"'Lutande yta'!Z$63","v":144.73780950385432}]
[null,null,"Maj",160.5246727272727,148.60584785306398,126.5344017508374,102.70302787637877,76.511339087135866,67.38038590901219,63.565750480366603,59.124458220565387,54.191455547520249,48.916629251231868,null,{"$f":"'Lutande yta'!Z$75","v":164.73380367120808}]
[null,null,"Juni",173.20248181818181,162.56339564377078,146.65160901956352,118.10919118112236,91.131967602824759,78.744688605595016,74.614907778911586,69.682266692284244,64.096641149093315,58.027747555005746,null,{"$f":"'Lutande yta'!Z$87","v":171.54254333380496}]
[null,null,"Juli",161.55701818181822,149.71779547473008,127.77818854389552,104.06628761980288,77.988469117333224,68.816165889938006,64.900555609246581,60.349277622473622,55.300620208189422,49.90798426718306,null,{"$f":"'Lutande yta'!Z$99","v":174.38787730977293}]
[null,null,"Augusti",117.80885454545452,103.2245195625835,85.349900903286823,64.910597644855926,56.768837436149092,53.767729470428236,50.264728652531936,46.366271889708038,42.190811817980617,37.865217678744365,null,{"$f":"'Lutande yta'!Z$111","v":154.68307175662784}]
[null,null,"September",65.753354545454542,53.896211428387545,40.373183207790639,35.566762225875202,34.063820182473961,32.210988644657881,30.064564961125477,27.689767129358124,25.15875217976836,22.548423720844109,null,{"$f":"'Lutande yta'!Z$123","v":116.91554828774875}]
[null,null,"Oktober",24.347972727272722,17.317420830135084,15.400764200363088,15.229030967432292,14.995955057882679,14.70861836528381,14.375751469640928,14.007468363139358,13.61495914160991,13.210149999129502,null,{"$f":"'Lutande yta'!Z$135","v":66.754330879699864}]
[null,null,"November",5.0344181818181823,3.8920312739607117,3.8656326900566471,3.8225271927871844,3.764024520874421,3.6919022484006474,3.6083517741193472,3.5159117369129782,3.4173908805351392,3.3157827113529135,null,{"$f":"'Lutande yta'!Z$147","v":26.724028210917165}]
[null,null,"December",0.92027272727272713,2.0520603385045959,3.1417269263967254,4.1561635230739133,5.0645469858758094,5.8392765429493902,6.4568124287350459,6.8983911278314141,7.1505954949160584,7.2057624279166745,null,{"$f":"'Lutande yta'!Z$159","v":17.303077039173296}]
[null,null,"Summa",{"$f":"SUM(D66:D77)","v":895.51699090909085},{"$f":"SUM(E66:E77)","v":793.46405750693395},668.42738971116,544.33649323292263,449.05518722050556,412.29408642380577,393.0690370502877,370.70812792807857,345.89078396569016,319.37106760123771,null,{"$f":"SUM(O66:O77)","v":1196.8357646529755}]

{"sheet":"Omslag","index":4,"n_rows":42,"n_cols":2,"rows_kept":42,"cut":false,"hidden":false,"merged":[]}
[]
[null,"Version 2016-02-19"]
[]
[null,"Mauritz Glaumann"]
[null,"email: mga@hig.se"]
[]
[]
[]
[]
[]
[]
[]
[]
[]
[]
[]
[]
[]
[null,"Solar Irradiation towards Inclined Surfaces (SITIS)"]
[null,"Solinstrålning mot olika ytor"]
[null,"Timvärden för ett genomsnittsdygn per månad"]
[]
[null,"Utgångsdata hämtas från SMHI som har en modell att generera timmedelvärden mot horisontalplanet för en godtycklick plats i norra Europa"]
[]
[]
[]
[]
[]
[]
[]
[]
[]
[]
[]
[]
[]
[]
[]
[]
[]
[null,"© EcoEffect "]
[null,"© M Glaumann"]

{"sheet":"Instruktion","index":5,"n_rows":23,"n_cols":8,"rows_kept":23,"cut":false,"hidden":false,"merged":[]}
["INSTRUKTION"]
[null,null,"Välj ort - klicka i rutan"]
[1,"Välj plats/ort. Det finns ett antal orter redan inlagda i rullgardinsmenyn  här intill. Välj någon av dem och fortsätt till punkt 4 eller gå vidare till punkt 2 och ta fram strålningsdata för en egen plats.","Stockholm",null,null,null,null,"Gävle"]
[2,"Bestäm koordinaterna för platsen, lat, long.",null,null,null,null,null,"Göteborg"]
[null,"a) Hämta koordinaterna för platsen t.ex. från  http://www.eniro.se Välj kartor och högerklicka på platsen och sen GPS-koordinater, WSG 84 decimal. Observera att du måste använda komma, inte punkt.",null,null,null,null,null,"Jönköping"]
[3,"Bestäm direkt och globalstrålning på platsen, flik Ort.",null,null,null,null,null,"Kalmar"]
[null,"a) Gå in på http://strang.smhi.se/",null,null,null,null,null,"Kiruna"]
[null,"b) Välj \"Data extraction\" - Extract historical (1999 - ) data .",null,null,null,null,null,"Ljusdal"]
[null,"c) Välj \"Time series\" och \"Monthly\".",null,null,null,null,null,"Luleå"]
[null,"d) Hämta data för direktstrålning - Direct irradiation.",null,null,null,null,null,"Malmö"]
[null,"e) Välj data från den senaste 10-årsperioden (tex Jan 2006- Dec 2015).",null,null,null,null,null,"Stockholm"]
[null,"f) Skriv in Latitud och Longitud längst ner.",null,null,null,null,null,"Östersund"]
[null,"g) \"Send request\""]
[null,"h) Kopeiera data (ctrl A, ctrl C) och klistra in som värden under fliken Ort, från cell B6  och nedåt."]
[null,"i) Markera de inkopierade data i Excelbladet (de är markerade direkt efter kopieringen). Gå till Data och sedan Text till kolumner. "]
[null,"j)Välj \"Med fast bredd\"."]
[null,"k) Skilj av data från tid genom att flytta strecken med pil så att de hamnar i var sin kolumn, dvs. 2 kolumner (de tre första strecken med pilar dras nedåt för att tas bort). Månadsmedelvärdena blir felmarkerade."]
[null,"l) Sök och byt ut alla punkter mot komma i kolumnen med strålningsdata."]
[null,"m) Gör samma sak med globalstrålningen \"Global irradiation\". Klistra in på cell E6, flik Ort."]
[4,"Gå till flik \"Lutande yta\""]
[null,"a) Skriv in ytans lutning och orientering i de blåa rutorna."]
[null,"b) Välj markreflektion (titta på tabellen till höger)."]
[5,"Avläs den årliga instrålningen i gula rutan till höger. \nVärden för enskilda tidpunkter kan avläsas i tabellerna under. Men tänk då på att timvärden representerar hela månaden så vill man se medelinstrålningen en viss timme måste man dela med antalet dagar i månaden."]

{"sheet":"Ort","index":6,"n_rows":125,"n_cols":18,"rows_kept":125,"cut":false,"hidden":false,"merged":[]}
[null,"Stockholm Bromma"]
[null,"Lat",59.353265,null,null,null,null,"Direktstrålning = vinkelrät mot strålningsriktningen"]
[null,"Long",17.947934,null,null,null,null,"Globalstrålning = instrålning mot horisontell yta, Wh/m2"]
[null,"SMHI nr",9720]
[null,"Direktstrålning",null,null,"Globalstrålning",null,null,"Medel direktstrålning år",null,null,null,null,null,"Medel globalstrålning år"]
[null,"2006 01 31 23",18975.8,null,"2006 01 31 23",10386.9,null,null,"kWh/m2","Standardav","%","Årsandel",null,null,"kWh/m2","Standardav","%","Årsandel"]
[null,"2006 02 28 23",29310.2,null,"2006 02 28 23",22437.200000000001,null,"Januari",{"$f":"(C6+C18+C30+C42+C54+C66+C78+C90+C102+C114)/10000","v":18.596490000000003},{"$f":"STDEV(C6,C18,C30,C42,C54,C66,C78,C90,C102,C114)","v":7025.6319191388166},{"$f":"J7/I7","v":377.79343946835212},{"$f":"I7/I$19","v":1.5957997830332405E-2},null,"Januari",{"$f":"(F6+F18+F30+F42+F54+F66+F78+F90+F102+F114)/10000","v":9.2210099999999997},{"$f":"STDEV(F6,F18,F30,F42,F54,F66,F78,F90,F102,F114)/10000","v":0.13393694340994844},{"$f":"P7/O7","v":1.4525192295632306E-2},{"$f":"O7/O$19","v":9.2633770740195055E-3}]
[null,"2006 03 31 23",85283.7,null,"2006 03 31 23",67249.7,null,"Februari",29.934600000000007,{"$f":"STDEV(C7,C19,C31,C43,C55,C67,C79,C91,C103,C115)/10000","v":1.191493246169135},3.98032125423134E-2,2.5687443267620312E-2,null,"Februari",21.961490000000001,0.43193263246457364,1.9667728941186305E-2,2.20623947894329E-2]
[null,"2006 04 30 23",115860.5,null,"2006 04 30 23",109405.7,null,"Mars",93.815119999999993,3.1306017437504479,3.3369906084972742E-2,8.0504518939454373E-2,null,"Mars",68.041290000000004,1.0953593294891306,1.6098450359908381E-2,6.8353914145273975E-2]
[null,"2006 05 31 23",166018.9,null,"2006 05 31 23",159499.29999999999,null,"April",134.66255999999998,3.6852295888804596,2.7366400793809802E-2,0.11555647545891762,null,"April",117.98345999999998,1.3253823648475596,1.1233628551388134E-2,0.11852554963908479]
[null,"2006 06 30 23",223001.7,null,"2006 06 30 23",192116,null,"Maj",168.87090999999998,4.9108667274105375,2.9080596103914749E-2,0.14491130398189433,null,"Maj",160.61618000000001,2.2055659188556889,1.3731903715153036E-2,0.16135415095836469]
[null,"2006 07 31 23",246615.9,null,"2006 07 31 23",198293.3,null,"Juni",186.51540999999997,4.6893861318477077,2.5142084141185482E-2,0.16005238128827312,null,"Juni",176.14682999999999,1.6457206175077226,9.3428909138343428E-3,0.17695615845587537]
[null,"2006 08 31 23",157487,null,"2006 08 31 23",133792.1,null,"Juli",182.90094999999997,4.562936286043727,2.4947581114497918E-2,0.15695074518179156,null,"Juli",169.63237000000001,2.0794845448227415,1.2258771983335146E-2,0.17041176696149277]
[null,"2006 09 30 23",126836.4,null,"2006 09 30 23",86163.4,null,"Augusti",144.06261999999998,3.8197638568017429,2.6514607722681591E-2,0.12362284374051238,null,"Augusti",132.00164000000001,1.8722363365249544,1.418343239163509E-2,0.13260813790560647]
[null,"2006 10 31 23",38526.300000000003,null,"2006 10 31 23",31337.4,null,"September",105.03949000000001,2.2501119085426673,2.1421580669733518E-2,9.0136361943529253E-2,null,"September",82.717770000000002,0.90459569146849406,1.093592938335371E-2,8.3097827052786899E-2]
[null,"2006 11 30 23",39080.6,null,"2006 11 30 23",14773.5,null,"Oktober",58.675040000000003,1.6902070711418098,2.8806236367999234E-2,5.0350155379572548E-2,null,"Oktober",38.802180000000007,0.56736675422124405,1.4622032943026499E-2,3.8980461428192607E-2]
[null,"2006 12 31 23",25657,null,"2006 12 31 23",7941.5,null,"November",25.104620000000001,1.1261454737367536,4.4858096786039921E-2,2.1542746587733464E-2,null,"November",12.108029999999999,0.2649759099763172,2.1884312309790876E-2,1.2163661845452981E-2]
[null,"2007 01 31 23",28575.599999999999,null,"2007 01 31 23",11470.2,null,"December",17.161990000000003,0.6853462639255179,3.9933962432417092E-2,1.4727026400368373E-2,null,"December",6.19414,{"$f":"STDEV(F17,F29,F41,F53,F65,F77,F89,F101,F113,L125)/10000","v":0.11356833120539252},1.8334802120293134E-2,6.2225997444170632E-3]
[null,"2007 02 28 23",19235,null,"2007 02 28 23",18116.099999999999,null,"Summa",{"$f":"SUM(I7:I18)","v":1165.3398000000002},"kWh/m2,år",null,{"$f":"SUM(L7:L18)","v":0.99999999999999967},null,"Summa",{"$f":"SUM(O7:O18)","v":995.42638999999997},"kWh/m2,år",null,{"$f":"SUM(R7:R18)","v":1}]
[null,"2007 03 31 23",94179.199999999997,null,"2007 03 31 23",65166]
[null,"2007 04 30 23",180654.8,null,"2007 04 30 23",134188.70000000001]
[null,"2007 05 31 23",152124.1,null,"2007 05 31 23",148099.6]
[null,"2007 06 30 23",218131.4,null,"2007 06 30 23",189149.8]
[null,"2007 07 31 23",157687.4,null,"2007 07 31 23",156511.70000000001]
[null,"2007 08 31 23",158528.79999999999,null,"2007 08 31 23",139566.39999999999]
[null,"2007 09 30 23",91242.3,null,"2007 09 30 23",77121.2]
[null,"2007 10 31 23",54889.4,null,"2007 10 31 23",37617.1]
[null,"2007 11 30 23",29824.7,null,"2007 11 30 23",13671.6]
[null,"2007 12 31 23",12818.2,null,"2007 12 31 23",4965.6000000000004]
[null,"2008 01 31 23",18163.8,null,"2008 01 31 23",9060.2999999999993]
[null,"2008 02 29 23",50808.9,null,"2008 02 29 23",27987.9]
[null,"2008 03 31 23",85670.2,null,"2008 03 31 23",65700.2]
[null,"2008 04 30 23",142046.9,null,"2008 04 30 23",122150.1]
[null,"2008 05 31 23",226856.9,null,"2008 05 31 23",186913.7]
[null,"2008 06 30 23",234001.9,null,"2008 06 30 23",201102.7]
[null,"2008 07 31 23",230234.8,null,"2008 07 31 23",195097.1]
[null,"2008 08 31 23",90458.2,null,"2008 08 31 23",107786.7]
[null,"2008 09 30 23",74317.600000000006,null,"2008 09 30 23",69718.5]
[null,"2008 10 31 23",61510.5,null,"2008 10 31 23",38147.4]
[null,"2008 11 30 23",29746.1,null,"2008 11 30 23",13117]
[null,"2008 12 31 23",15319.7,null,"2008 12 31 23",5508.6]
[null,"2009 01 31 23",26353.8,null,"2009 01 31 23",8935.7999999999993]
[null,"2009 02 28 23",32397.1,null,"2009 02 28 23",23452.2]
[null,"2009 03 31 23",52923.6,null,"2009 03 31 23",53558.5]
[null,"2009 04 30 23",179783.4,null,"2009 04 30 23",137932.9]
[null,"2009 05 31 23",210142.8,null,"2009 05 31 23",180200.9]
[null,"2009 06 30 23",187553.4,null,"2009 06 30 23",161519.79999999999]
[null,"2009 07 31 23",159847.79999999999,null,"2009 07 31 23",139994.70000000001]
[null,"2009 08 31 23",190541.3,null,"2009 08 31 23",136979.79999999999]
[null,"2009 09 30 23",135731.70000000001,null,"2009 09 30 23",90516]
[null,"2009 10 31 23",59006.9,null,"2009 10 31 23",38087.800000000003]
[null,"2009 11 30 23",8480.1,null,"2009 11 30 23",8330.5]
[null,"2009 12 31 23",6430.5,null,"2009 12 31 23",4500.2]
[null,"2010 01 31 23",8293.1,null,"2010 01 31 23",7929.4]
[null,"2010 02 28 23",14766.8,null,"2010 02 28 23",15107]
[null,"2010 03 31 23",89442.6,null,"2010 03 31 23",61953.3]
[null,"2010 04 30 23",126819.7,null,"2010 04 30 23",105986.6]
[null,"2010 05 31 23",181758,null,"2010 05 31 23",142654.20000000001]
[null,"2010 06 30 23",232195.8,null,"2010 06 30 23",172782.2]
[null,"2010 07 31 23",237361.6,null,"2010 07 31 23",165411.20000000001]
[null,"2010 08 31 23",105044.7,null,"2010 08 31 23",98978.3]
[null,"2010 09 30 23",84555.6,null,"2010 09 30 23",71922.3]
[null,"2010 10 31 23",71069.100000000006,null,"2010 10 31 23",43017.599999999999]
[null,"2010 11 30 23",29965.599999999999,null,"2010 11 30 23",12546.6]
[null,"2010 12 31 23",15804.9,null,"2010 12 31 23",5868.2]
[null,"2011 01 31 23",25932.2,null,"2011 01 31 23",10140.1]
[null,"2011 02 28 23",36246.199999999997,null,"2011 02 28 23",24862.9]
[null,"2011 03 31 23",127534.7,null,"2011 03 31 23",75087.5]
[null,"2011 04 30 23",156321,null,"2011 04 30 23",122238]
[null,"2011 05 31 23",196110.2,null,"2011 05 31 23",171476.3]
[null,"2011 06 30 23",205238,null,"2011 06 30 23",182317.3]
[null,"2011 07 31 23",151726.79999999999,null,"2011 07 31 23",156572.20000000001]
[null,"2011 08 31 23",133618.70000000001,null,"2011 08 31 23",127037]
[null,"2011 09 30 23",102338.1,null,"2011 09 30 23",81127.100000000006]
[null,"2011 10 31 23",81175.600000000006,null,"2011 10 31 23",44489.599999999999]
[null,"2011 11 30 23",27729,null,"2011 11 30 23",11447.2]
[null,"2011 12 31 23",23283.1,null,"2011 12 31 23",6967.2]
[null,"2012 01 31 23",16645.3,null,"2012 01 31 23",8829.7999999999993]
[null,"2012 02 29 23",44247.5,null,"2012 02 29 23",27302.400000000001]
[null,"2012 03 31 23",95754.1,null,"2012 03 31 23",67336.7]
[null,"2012 04 30 23",105207.1,null,"2012 04 30 23",104550.6]
[null,"2012 05 31 23",192898.3,null,"2012 05 31 23",185015.3]
[null,"2012 06 30 23",144037.70000000001,null,"2012 06 30 23",163217]
[null,"2012 07 31 23",150705.70000000001,null,"2012 07 31 23",169353.8]
[null,"2012 08 31 23",115475.1,null,"2012 08 31 23",133264.6]
[null,"2012 09 30 23",95790.8,null,"2012 09 30 23",83429.100000000006]
[null,"2012 10 31 23",60129.3,null,"2012 10 31 23",41341.199999999997]
[null,"2012 11 30 23",24577.3,null,"2012 11 30 23",12785.8]
[null,"2012 12 31 23",7629.8,null,"2012 12 31 23",5028.1000000000004]
[null,"2013 01 31 23",20713.099999999999,null,"2013 01 31 23",9488.7999999999993]
[null,"2013 02 28 23",27799.1,null,"2013 02 28 23",21540.1]
[null,"2013 03 31 23",157188.5,null,"2013 03 31 23",95207.7]
[null,"2013 04 30 23",156570.9,null,"2013 04 30 23",125333.3]
[null,"2013 05 31 23",188827.1,null,"2013 05 31 23",172843.7]
[null,"2013 06 30 23",188691.5,null,"2013 06 30 23",185070.1]
[null,"2013 07 31 23",202552.2,null,"2013 07 31 23",186488.9]
[null,"2013 08 31 23",176030.4,null,"2013 08 31 23",153276.4]
[null,"2013 09 30 23",127912,null,"2013 09 30 23",96968.2]
[null,"2013 10 31 23",62348.6,null,"2013 10 31 23",41368.199999999997]
[null,"2013 11 30 23",35264.9,null,"2013 11 30 23",15687.8]
[null,"2013 12 31 23",18227,null,"2013 12 31 23",6705.9]
[null,"2014 01 31 23",12763.5,null,"2014 01 31 23",9367.1]
[null,"2014 02 28 23",14389.3,null,"2014 02 28 23",16474.099999999999]
[null,"2014 03 31 23",51299.8,null,"2014 03 31 23",62777.4]
[null,"2014 04 30 23",59350.2,null,"2014 04 30 23",97353.3]
[null,"2014 05 31 23",63998.9,null,"2014 05 31 23",124647.8]
[null,"2014 06 30 23",93174,null,"2014 06 30 23",148301.70000000001]
[null,"2014 07 31 23",186186.5,null,"2014 07 31 23",184817.7]
[null,"2014 08 31 23",112464.8,null,"2014 08 31 23",127449.60000000001]
[null,"2014 09 30 23",127841.4,null,"2014 09 30 23",93150.1]
[null,"2014 10 31 23",23731.5,null,"2014 10 31 23",27474.400000000001]
[null,"2014 11 30 23",2994.2,null,"2014 11 30 23",7198.1]
[null,"2014 12 31 23",21186,null,"2014 12 31 23",6774.4]
[null,"2015 01 31 23",9548.7000000000007,null,"2015 01 31 23",6601.7]
[null,"2015 02 28 23",30145.9,null,"2015 02 28 23",22335]
[null,"2015 03 31 23",98874.8,null,"2015 03 31 23",66375.899999999994]
[null,"2015 04 30 23",124011.1,null,"2015 04 30 23",120695.4]
[null,"2015 05 31 23",109973.9,null,"2015 05 31 23",134811]
[null,"2015 06 30 23",139128.70000000001,null,"2015 06 30 23",165891.70000000001]
[null,"2015 07 31 23",106090.8,null,"2015 07 31 23",143783.1]
[null,"2015 08 31 23",200977.2,null,"2015 08 31 23",161885.5]
[null,"2015 09 30 23",83829,null,"2015 09 30 23",77061.8]
[null,"2015 10 31 23",74363.199999999997,null,"2015 10 31 23",45141.1]
[null,"2015 11 30 23",23383.7,null,"2015 11 30 23",11522.2]
[null,"2015 12 31 23",25263.7,null,"2015 12 31 23",7681.7]

{"sheet":"Mot marken","index":7,"n_rows":169,"n_cols":28,"rows_kept":169,"cut":false,"hidden":false,"merged":[]}
["SOLINSTRÅLNING MOT MARKEN",null,null,null,null,null,"PLATS",{"$f":"Ort!B1","v":"Stockholm Bromma"},null,null,"Latitud",{"$f":"Ort!C2","v":59.353265},"Longitud",{"$f":"Ort!C3","v":17.947934}]
[]
["Solhöjd","h","ARCSIN(SIN(C154*PI()/180)*SIN(C155*PI()/180)+COS(C154*PI()/180)*COS(C155*PI()/180)*COS((B156+12)*15*PI()/180))*180/PI()"]
["Solazimut","A","ARCSIN((SIN((b156+12)*15*PI()/180)*COS(C156*PI()/180))/COS(b158*PI()/180))*180/PI()"]
["Direktinstrålning","IDN","1071*EXP(-0,129/SIN(h*PI()/180)) (Brown & Isfält 1974) Wh"]
["Globalstrålning","IDH","IDN  * sin h Wh",null,null,null,null,null,null,"sin (h) = sin (d)sin(l) - cos (d) cos (l)cos(t)"]
["Diffusstrålning mot mark","IdH","244*SIN(h*PI()/180) (Ångström)",null,null,null,null,null,null,"sin (As) = cos(d)sin(t)/cos(h)"]
["Latitud","Lat",{"$f":"Ort!C2","v":59.353265}]
[null,null,null,null,null,null,null,null,null,"Solen under horisonten"]
[]
["Januari","deklination",-19.899999999999999,null,null,null,"180+",null,null,null,null,null,null,null,null,null,null,null,null,"180-",null,null,null,null,null,"kWh/m2"]
["Kl",1,2,3,4,5,6,7,8,9,10,11,12,13,14,15,16,17,18,19,20,21,22,23,24]
["solhöjd",{"$f":"ASIN(SIN($C$8*PI()/180)*SIN($C11*PI()/180)+COS($C$8*PI()/180)*COS($C11*PI()/180)*COS((B12+12)*15*PI()/180))*180/PI()","v":-49.096302966539028},-45.066612242610958,-39.179929280617458,-32.173873308672007,-24.638456780898583,-17.027912962177034,-9.7171337135258558,-3.0487002796175164,2.641278984074086,7.022163422718732,9.7957327703534496,10.746735000000012,9.7957327703534514,7.0221634227187497,2.6412789840741113,-3.0487002796175284,-9.7171337135258646,-17.027912962177016,-24.638456780898565,-32.173873308671965,-39.179929280617479,-45.066612242610972,-49.096302966539014,-50.546735000000012]
["azimut",{"$f":"-(180+ASIN((SIN((B12*15-180)*PI()/180)*(COS($C11*PI()/180))/(COS(B13*PI()/180))))*180/PI())","v":-158.18146280680716},{"$f":"-(180+ASIN((SIN((C12*15-180)*PI()/180)*(COS($C11*PI()/180))/(COS(C13*PI()/180))))*180/PI())","v":-138.26713973182521},{"$f":"-(180+ASIN((SIN((D12*15-180)*PI()/180)*(COS($C11*PI()/180))/(COS(D13*PI()/180))))*180/PI())","v":-120.93718492399935},{"$f":"-(180+ASIN((SIN((E12*15-180)*PI()/180)*(COS($C11*PI()/180))/(COS(E13*PI()/180))))*180/PI())","v":-105.83541512018189},{"$f":"-(180+ASIN((SIN((F12*15-180)*PI()/180)*(COS($C11*PI()/180))/(COS(F13*PI()/180))))*180/PI())","v":-92.261433351179505},{"$f":"(ASIN((SIN((G12*15-180)*PI()/180)*(COS($C11*PI()/180))/(COS(G13*PI()/180))))*180/PI())","v":-79.545126017601021},-67.141773170231858,-54.633617905499761,-41.727697866177074,-28.274565045280941,-14.297993919623277,0,14.297993919623277,28.274565045280941,41.727697866177074,54.633617905499783,67.141773170231872,79.545126017600978,{"$f":"(180-ASIN((SIN((T12*15-180)*PI()/180)*(COS($C11*PI()/180))/(COS(T13*PI()/180))))*180/PI())","v":92.261433351179662},105.83541512018199,120.93718492399935,138.26713973182518,158.18146280680719,180,"Summa"]
["Direktstrålning, IDN",{"$f":"IF(B13<0,0,1071*EXP(-0.129/SIN(B13*PI()/180)))","v":0},0,0,0,0,0,0,0,65.172151083364341,372.84456607708654,501.76485674336857,536.2178682895393,501.76485674336857,372.84456607708756,65.172151083366117,0,0,0,0,0,0,0,0,0,{"$f":"SUM(B15:Y15)","v":2415.7810160971812},"dygnssumma, Wh"]
["andel,%",{"$f":"B15/$Z15","v":0},0,0,0,0,0,0,0,2.697767332763187E-2,0.1543370709483578,0.20770295544171283,0.22196460056459377,0.20770295544171283,0.15433707094835822,2.6977673327632606E-2,0,0,0,0,0,0,0,0,0,0.99999999999999989]
["Uppmätt IDN fördelad",{"$f":"B16*Ort!$I7","v":0},{"$f":"C16*Ort!$I7","v":0},{"$f":"D16*Ort!$I7","v":0},{"$f":"E16*Ort!$I7","v":0},{"$f":"F16*Ort!$I7","v":0},{"$f":"G16*Ort!$I7","v":0},{"$f":"H16*Ort!$I7","v":0},{"$f":"I16*Ort!$I7","v":0},{"$f":"J16*Ort!$I7","v":0.50169003226057285},{"$f":"K16*Ort!$I7","v":2.8701277965204266},{"$f":"L16*Ort!$I7","v":3.862545933842259},{"$f":"M16*Ort!$I7","v":4.1277624747534629},{"$f":"N16*Ort!$I7","v":3.862545933842259},{"$f":"O16*Ort!$I7","v":2.8701277965204346},{"$f":"P16*Ort!$I7","v":0.5016900322605865},{"$f":"Q16*Ort!$I7","v":0},{"$f":"R16*Ort!$I7","v":0},{"$f":"S16*Ort!$I7","v":0},{"$f":"T16*Ort!$I7","v":0},{"$f":"U16*Ort!$I7","v":0},{"$f":"V16*Ort!$I7","v":0},{"$f":"W16*Ort!$I7","v":0},{"$f":"X16*Ort!$I7","v":0},{"$f":"Y16*Ort!$I7","v":0},18.596490000000003]
["Direktstr, IDH",{"$f":"IF(B13<0,0,B17*SIN(B13*PI()/180))","v":0},0,0,0,0,0,0,0,2.3119225641129438E-2,0.35088252464442232,0.6571585331815607,0.76969582270852266,0.6571585331815607,0.35088252464442421,2.3119225641130291E-2,0,0,0,0,0,0,0,0,0,2.8320163896427504]
["Diffusstrålning, IdH",{"$f":"IF(B13<0,0,244*SIN(B13*PI()/180))","v":0},0,0,0,0,0,0,0,11.244176072259805,29.829799257382899,41.513210416839321,45.498204387861861,41.513210416839321,29.829799257382977,11.244176072259913,0,0,0,0,0,0,0,0,0,210.67257588082606]
["andel,%",{"$f":"B19/$Z19","v":0},0,0,0,0,0,0,0,5.337275639815809E-2,0.14159317667553045,0.19705085127132374,0.21596643130997473,0.19705085127132374,0.14159317667553081,5.3372756398158604E-2,0,0,0,0,0,0,0,0,0,1.0000000000000002]
["Global, IDH + IdH fördelad",{"$f":"B20*Ort!$O7","v":0},{"$f":"C20*Ort!$O7","v":0},{"$f":"D20*Ort!$O7","v":0},{"$f":"E20*Ort!$O7","v":0},{"$f":"F20*Ort!$O7","v":0},{"$f":"G20*Ort!$O7","v":0},{"$f":"H20*Ort!$O7","v":0},{"$f":"I20*Ort!$O7","v":0},{"$f":"J20*Ort!$O7","v":0.49215072047497971},{"$f":"K20*Ort!$O7","v":1.305632098056833},{"$f":"L20*Ort!$O7","v":1.817007870081389},{"$f":"M20*Ort!$O7","v":1.99142862277359},{"$f":"N20*Ort!$O7","v":1.817007870081389},{"$f":"O20*Ort!$O7","v":1.3056320980568363},{"$f":"P20*Ort!$O7","v":0.49215072047498443},{"$f":"Q20*Ort!$O7","v":0},{"$f":"R20*Ort!$O7","v":0},{"$f":"S20*Ort!$O7","v":0},{"$f":"T20*Ort!$O7","v":0},{"$f":"U20*Ort!$O7","v":0},{"$f":"V20*Ort!$O7","v":0},{"$f":"W20*Ort!$O7","v":0},{"$f":"X20*Ort!$O7","v":0},{"$f":"Y20*Ort!$O7","v":0},9.2210100000000015]
["Diffusstrål, IdH fördelad",{"$f":"B21-B18","v":0},0,0,0,0,0,0,0,0.46903149483385026,0.95474957341241073,1.1598493368998284,1.2217328000650673,1.1598493368998284,0.95474957341241207,0.46903149483385415,0,0,0,0,0,0,0,0,0,6.3889936103572511]
[]
["Februari","deklination",-10.9]
["Kl",1,2,3,4,5,6,7,8,9,10,11,12,13,14,15,16,17,18,19,20,21,22,23,24]
["solhöjd",{"$f":"ASIN(SIN($C$8*PI()/180)*SIN($C24*PI()/180)+COS($C$8*PI()/180)*COS($C24*PI()/180)*COS((B25+12)*15*PI()/180))*180/PI()","v":-40.25383119762013},-36.596095571113672,-31.106063294891488,-24.390742426483417,-16.991803629736726,-9.3627095266048297,-1.8987143706484662,5.0249553163656548,11.02610885897133,15.712026703287284,18.711757746754955,19.746735000000008,18.711757746754959,15.712026703287302,11.026108858971359,5.0249553163656415,-1.8987143706484775,-9.3627095266048155,-16.991803629736712,-24.390742426483385,-31.106063294891491,-36.596095571113686,-40.253831197620123,-41.54673500000002]
["azimut",{"$f":"-(180+ASIN((SIN((B25*15-180)*PI()/180)*(COS($C24*PI()/180))/(COS(B26*PI()/180))))*180/PI())","v":-160.548430791253},{"$f":"-(180+ASIN((SIN((C25*15-180)*PI()/180)*(COS($C24*PI()/180))/(COS(C26*PI()/180))))*180/PI())","v":-142.29910554099791},{"$f":"-(180+ASIN((SIN((D25*15-180)*PI()/180)*(COS($C24*PI()/180))/(COS(D26*PI()/180))))*180/PI())","v":-125.81066607608309},{"$f":"-(180+ASIN((SIN((E25*15-180)*PI()/180)*(COS($C24*PI()/180))/(COS(E26*PI()/180))))*180/PI())","v":-110.97497954380407},{"$f":"-(180+ASIN((SIN((F25*15-180)*PI()/180)*(COS($C24*PI()/180))/(COS(F26*PI()/180))))*180/PI())","v":-97.344922965887164},{"$f":"(ASIN((SIN((G25*15-180)*PI()/180)*(COS($C24*PI()/180))/(COS(G26*PI()/180))))*180/PI())","v":-84.39374408726556},-71.626214570464498,-58.614453032217043,-45.024439130939548,-30.666289292353802,-15.565063342381514,0,15.565063342381514,30.666289292353802,45.024439130939548,58.614453032217043,71.626214570464498,84.39374408726556,{"$f":"(180-ASIN((SIN((T25*15-180)*PI()/180)*(COS($C24*PI()/180))/(COS(T26*PI()/180))))*180/PI())","v":97.344922965887207},110.9749795438041,125.81066607608311,142.29910554099791,160.548430791253,180,"Summa"]
["Direktstr, IDN",{"$f":"IF(B26<0,0,1071*EXP(-0.129/SIN(B26*PI()/180)))","v":0},0,0,0,0,0,0,245.56728336788711,545.58599963760082,665.13243516416742,716.39923181612437,731.09002348460547,716.39923181612437,665.13243516416787,545.58599963760184,245.56728336788618,0,0,0,0,0,0,0,0,{"$f":"SUM(B28:Y28)","v":5076.4599234561656}]
["andel,%",{"$f":"B28/$Z28","v":0},0,0,0,0,0,0,4.837372639016118E-2,0.10747371354527584,0.13102288704986578,0.14112181374779456,0.14401571853380521,0.14112181374779456,0.13102288704986587,0.10747371354527603,4.8373726390160993E-2,0,0,0,0,0,0,0,0,1,null,{"$f":"-(180+ASIN((SIN((B38*15-180)*PI()/180)*(COS($C37*PI()/180))/(COS(B39*PI()/180))))*180/PI())","v":-162.70076983452199}]
["Uppmätt IDN fördelad",{"$f":"B29*Ort!$I8","v":0},{"$f":"C29*Ort!$I8","v":0},{"$f":"D29*Ort!$I8","v":0},{"$f":"E29*Ort!$I8","v":0},{"$f":"F29*Ort!$I8","v":0},{"$f":"G29*Ort!$I8","v":0},{"$f":"H29*Ort!$I8","v":0},{"$f":"I29*Ort!$I8","v":1.4480481499989193},{"$f":"J29*Ort!$I8","v":3.217182625492415},{"$f":"K29*Ort!$I8","v":3.9221177146829129},{"$f":"L29*Ort!$I8","v":4.2244250458147317},{"$f":"M29*Ort!$I8","v":4.311052928022046},{"$f":"N29*Ort!$I8","v":4.2244250458147317},{"$f":"O29*Ort!$I8","v":3.9221177146829156},{"$f":"P29*Ort!$I8","v":3.2171826254924207},{"$f":"Q29*Ort!$I8","v":1.4480481499989135},{"$f":"R29*Ort!$I8","v":0},{"$f":"S29*Ort!$I8","v":0},{"$f":"T29*Ort!$I8","v":0},{"$f":"U29*Ort!$I8","v":0},{"$f":"V29*Ort!$I8","v":0},{"$f":"W29*Ort!$I8","v":0},{"$f":"X29*Ort!$I8","v":0},{"$f":"Y29*Ort!$I8","v":0},29.934600000000003]
["Direktstr, IDH",{"$f":"IF(B26<0,0,B30*SIN(B26*PI()/180))","v":0},0,0,0,0,0,0,0.12683400094917938,0.61530640958900029,1.0621193388041026,1.3552266556519452,1.456545639874127,1.3552266556519452,1.0621193388041046,0.61530640958900307,0.12683400094917854,0,0,0,0,0,0,0,0,7.7755184498625862,null,{"$f":"-(180+ASIN((SIN((D38*15-180)*PI()/180))))","v":-179.21460183660255}]
["Global, IdH",{"$f":"IF(B26<0,0,244*SIN(B26*PI()/180))","v":0},0,0,0,0,0,0,21.371869596755374,46.666534485817941,66.075813507079516,78.276996370591277,82.438592627612849,78.276996370591277,66.075813507079587,46.666534485818062,21.371869596755317,0,0,0,0,0,0,0,0,507.22102054810125]
["andel,%",{"$f":"B32/$Z32","v":0},0,0,0,0,0,0,4.2135220605922459E-2,9.2004338533506064E-2,0.13027025858604643,0.15432522154938577,0.16252992145027823,0.15432522154938577,0.13027025858604657,9.20043385335063E-2,4.2135220605922348E-2,0,0,0,0,0,0,0,0,1]
["Global IDH + IdH fördelad",{"$f":"B33*Ort!$O8","v":0},{"$f":"C33*Ort!$O8","v":0},{"$f":"D33*Ort!$O8","v":0},{"$f":"E33*Ort!$O8","v":0},{"$f":"F33*Ort!$O8","v":0},{"$f":"G33*Ort!$O8","v":0},{"$f":"H33*Ort!$O8","v":0},{"$f":"I33*Ort!$O8","v":0.92535222598476008},{"$f":"J33*Ort!$O8","v":2.0205523606602083},{"$f":"K33*Ort!$O8","v":2.8609289812348733},{"$f":"L33*Ort!$O8","v":3.3892118098046202},{"$f":"M33*Ort!$O8","v":3.5693992446310712},{"$f":"N33*Ort!$O8","v":3.3892118098046202},{"$f":"O33*Ort!$O8","v":2.8609289812348759},{"$f":"P33*Ort!$O8","v":2.0205523606602136},{"$f":"Q33*Ort!$O8","v":0.92535222598475764},{"$f":"R33*Ort!$O8","v":0},{"$f":"S33*Ort!$O8","v":0},{"$f":"T33*Ort!$O8","v":0},{"$f":"U33*Ort!$O8","v":0},{"$f":"V33*Ort!$O8","v":0},{"$f":"W33*Ort!$O8","v":0},{"$f":"X33*Ort!$O8","v":0},{"$f":"Y33*Ort!$O8","v":0},21.961490000000005]
["Diffusstrål IdH",{"$f":"B34-B31","v":0},0,0,0,0,0,0,0.79851822503558068,1.4052459510712079,1.7988096424307707,2.033985154152675,2.1128536047569444,2.033985154152675,1.7988096424307713,1.4052459510712105,0.79851822503557912,0,0,0,0,0,0,0,0,14.185971550137415]
[]
["Mars","deklination",0]
["Kl",1,2,3,4,5,6,7,8,9,10,11,12,13,14,15,16,17,18,19,20,21,22,23,24]
["solhöjd",{"$f":"ASIN(SIN($C$8*PI()/180)*SIN($C37*PI()/180)+COS($C$8*PI()/180)*COS($C37*PI()/180)*COS((B38+12)*15*PI()/180))*180/PI()","v":-29.496754156026245},-26.196476812473012,-21.127402789816724,-14.765981014739745,-7.581208084653043,-5.3672789234552306E-15,7.5812080846530563,14.765981014739737,21.12740278981671,26.196476812473009,29.496754156026245,30.64673500000001,29.496754156026245,26.196476812473026,21.127402789816745,14.765981014739721,7.5812080846530465,8.9454648724253859E-15,-7.5812080846530288,-14.765981014739712,-21.127402789816731,-26.196476812473023,-29.496754156026245,-30.64673500000001]
["azimut",{"$f":"-(180+ASIN((SIN((B38*15-180)*PI()/180)*(COS($C37*PI()/180))/(COS(B39*PI()/180))))*180/PI())","v":-162.70076983452199},{"$f":"-(180+ASIN((SIN((C38*15-180)*PI()/180)*(COS($C37*PI()/180))/(COS(C39*PI()/180))))*180/PI())","v":-146.13512059411954},{"$f":"-(180+ASIN((SIN((D38*15-180)*PI()/180)*(COS($C37*PI()/180))/(COS(D39*PI()/180))))*180/PI())","v":-130.70628382281495},{"$f":"-(180+ASIN((SIN((E38*15-180)*PI()/180)*(COS($C37*PI()/180))/(COS(E39*PI()/180))))*180/PI())","v":-116.41403889135285},{"$f":"-(180+ASIN((SIN((F38*15-180)*PI()/180)*(COS($C37*PI()/180))/(COS(F39*PI()/180))))*180/PI())","v":-102.98126481840468},{"$f":"(ASIN((SIN((G38*15-180)*PI()/180)*(COS($C37*PI()/180))/(COS(G39*PI()/180))))*180/PI())","v":-90},-77.018735181595318,-63.585961108647133,-49.293716177185026,-33.864879405880451,-17.299230165478001,0,17.299230165478001,33.864879405880451,49.293716177185033,63.585961108647126,77.018735181595318,90,{"$f":"(180-ASIN((SIN((T38*15-180)*PI()/180)*(COS($C37*PI()/180))/(COS(T39*PI()/180))))*180/PI())","v":102.98126481840468},116.41403889135287,130.70628382281495,146.13512059411954,162.70076983452199,180,"Summa",null,{"$f":"ASIN((SIN((B38*15-180))))","v":-1.5044106402590391}]
["Direktstr, IDN",{"$f":"IF(B39<0,0,1071*EXP(-0.129/SIN(B39*PI()/180)))","v":0},0,0,0,0,0,402.85082410656577,645.6199368772352,748.78741194792212,799.6144669648636,824.14974494203693,831.54010871125081,824.14974494203693,799.61446696486371,748.78741194792258,645.61993687723486,402.8508241065652,0,0,0,0,0,0,0,{"$f":"SUM(B41:Y41)","v":7673.5848783884976},null,{"$f":"(COS($C37*PI()/180))/(COS(B39*PI()/180))*180/PI()","v":65.828193600594702}]
["andel,%",{"$f":"B41/$Z41","v":0},0,0,0,0,0,5.2498386411432653E-2,8.4135374418744885E-2,9.7579869619578943E-2,0.10420350848230765,0.1074008769047608,0.10836396832635017,0.1074008769047608,0.10420350848230768,9.7579869619578999E-2,8.4135374418744843E-2,5.2498386411432577E-2,0,0,0,0,0,0,0,1]
["Uppmätt IDN fördelad",{"$f":"B42*Ort!$I9","v":0},{"$f":"C42*Ort!$I9","v":0},{"$f":"D42*Ort!$I9","v":0},{"$f":"E42*Ort!$I9","v":0},{"$f":"F42*Ort!$I9","v":0},{"$f":"G42*Ort!$I9","v":0},{"$f":"H42*Ort!$I9","v":4.9251424209949235},{"$f":"I42*Ort!$I9","v":7.8931702473394809},{"$f":"J42*Ort!$I9","v":9.1544671779451523},{"$f":"K42*Ort!$I9","v":9.7758646526887087},{"$f":"L42*Ort!$I9","v":10.075826154925362},{"$f":"M42*Ort!$I9","v":10.166178692212741},{"$f":"N42*Ort!$I9","v":10.075826154925362},{"$f":"O42*Ort!$I9","v":9.7758646526887123},{"$f":"P42*Ort!$I9","v":9.1544671779451576},{"$f":"Q42*Ort!$I9","v":7.8931702473394774},{"$f":"R42*Ort!$I9","v":4.9251424209949164},{"$f":"S42*Ort!$I9","v":0},{"$f":"T42*Ort!$I9","v":0},{"$f":"U42*Ort!$I9","v":0},{"$f":"V42*Ort!$I9","v":0},{"$f":"W42*Ort!$I9","v":0},{"$f":"X42*Ort!$I9","v":0},{"$f":"Y42*Ort!$I9","v":0},93.815119999999993]
["Direktstr, IDH",{"$f":"IF(B39<0,0,B43*SIN(B39*PI()/180))","v":0},0,0,0,0,0,0.64978036096298231,2.0117454670080046,3.2996633346963371,4.3155620832965278,4.9610773772450019,5.1821418416119771,4.9610773772450019,4.3155620832965322,3.2996633346963447,2.0117454670080015,0.64978036096298042,0,0,0,0,0,0,0,35.657799088029691]
["Global, IdH",{"$f":"IF(B39<0,0,244*SIN(B39*PI()/180))","v":0},0,0,0,0,0,32.191233171068355,62.188687000056454,87.948084581655166,107.71396554009586,120.13931775272351,124.37737400011288,120.13931775272351,107.71396554009593,87.948084581655309,62.188687000056383,32.191233171068305,3.8095186895457463E-14,0,0,0,0,0,0,944.7399500913117]
["andel,%",{"$f":"B45/$Z45","v":0},0,0,0,0,0,3.4074173710931757E-2,6.5826248793697931E-2,9.3092373804193149E-2,0.11401440738235427,0.12716654751512491,0.13165249758739583,0.12716654751512491,0.11401440738235435,9.3092373804193301E-2,6.5826248793697861E-2,3.4074173710931709E-2,4.0323463501014704E-17,0,0,0,0,0,0,0.99999999999999989]
["Global, IDH + IdH fördelad",{"$f":"B46*Ort!$O9","v":0},{"$f":"C46*Ort!$O9","v":0},{"$f":"D46*Ort!$O9","v":0},{"$f":"E46*Ort!$O9","v":0},{"$f":"F46*Ort!$O9","v":0},{"$f":"G46*Ort!$O9","v":0},{"$f":"H46*Ort!$O9","v":2.3184507349758841},{"$f":"I46*Ort!$O9","v":4.4789028837841514},{"$f":"J46*Ort!$O9","v":6.3341252027995099},{"$f":"K46*Ort!$O9","v":7.7576873568809086},{"$f":"L46*Ort!$O9","v":8.6525759377753939},{"$f":"M46*Ort!$O9","v":8.9578057675683009},{"$f":"N46*Ort!$O9","v":8.6525759377753939},{"$f":"O46*Ort!$O9","v":7.7576873568809139},{"$f":"P46*Ort!$O9","v":6.3341252027995196},{"$f":"Q46*Ort!$O9","v":4.4789028837841469},{"$f":"R46*Ort!$O9","v":2.3184507349758805},{"$f":"S46*Ort!$O9","v":2.7436604738769571E-15},{"$f":"T46*Ort!$O9","v":0},{"$f":"U46*Ort!$O9","v":0},{"$f":"V46*Ort!$O9","v":0},{"$f":"W46*Ort!$O9","v":0},{"$f":"X46*Ort!$O9","v":0},{"$f":"Y46*Ort!$O9","v":0},68.041290000000018,null,{"$f":"Z44+Z48","v":68.041290000000004}]
["Diffusstrål, IdH fördelad",{"$f":"B47-B44","v":0},0,0,0,0,0,1.6686703740129016,2.4671574167761467,3.0344618681031728,3.4421252735843808,3.691498560530392,3.7756639259563238,3.691498560530392,3.4421252735843817,3.034461868103175,2.4671574167761454,1.6686703740129001,2.7436604738769571E-15,0,0,0,0,0,0,32.383490911970313]
[]
["April","deklination",10.9]
["Kl",1,2,3,4,5,6,7,8,9,10,11,12,13,14,15,16,17,18,19,20,21,22,23,24]
["solhöjd",{"$f":"ASIN(SIN($C$8*PI()/180)*SIN($C50*PI()/180)+COS($C$8*PI()/180)*COS($C50*PI()/180)*COS((B51+12)*15*PI()/180))*180/PI()","v":-18.711757746754959},-15.712026703287291,-11.026108858971339,-5.0249553163656646,1.898714370648481,9.362709526604819,16.99180362973674,24.390742426483413,31.106063294891477,36.596095571113672,40.253831197620123,41.54673500000002,40.25383119762013,36.596095571113686,31.106063294891509,24.390742426483396,16.991803629736726,9.3627095266048332,1.8987143706484935,-5.0249553163656291,-11.026108858971348,-15.712026703287293,-18.711757746754955,-19.746735000000008]
["azimut",{"$f":"-(180+ASIN((SIN((B51*15-180)*PI()/180)*(COS($C50*PI()/180))/(COS(B52*PI()/180))))*180/PI())","v":-164.43493665761847},-149.33371070764619,-134.97556086906044,-121.38554696778294,-108.3737854295355,-95.60625591273444,{"$f":"(ASIN((SIN((H51*15-180)*PI()/180)*(COS($C50*PI()/180))/(COS(H52*PI()/180))))*180/PI())","v":-82.655077034112836},-69.025020456195904,-54.189333923916855,-37.7008944590021,-19.451569208746974,0,19.451569208746978,37.7008944590021,54.189333923916898,69.025020456195904,82.655077034112836,{"$f":"(180-ASIN((SIN((S51*15-180)*PI()/180)*(COS($C50*PI()/180))/(COS(S52*PI()/180))))*180/PI())","v":95.606255912734383},108.3737854295355,121.38554696778294,134.97556086906044,149.33371070764619,164.43493665761847,180,"Summa"]
["Direktstr, IDN",{"$f":"IF(B52<0,0,1071*EXP(-0.129/SIN(B52*PI()/180)))","v":0},0,0,0,21.822021658886811,484.63640421386651,688.78030025760768,783.65360352264031,834.34751636348369,862.61364018756854,877.1795935609523,881.69450074277677,877.1795935609523,862.61364018756854,834.34751636348392,783.6536035226402,688.78030025760745,484.63640421386702,21.822021658887362,0,0,0,0,0,{"$f":"SUM(B54:Y54)","v":9987.7606602727883}]
["andel,%",{"$f":"B54/$Z54","v":0},0,0,0,2.1848763102309664E-3,4.8523029405535434E-2,6.8962435493402738E-2,7.8461391915376252E-2,8.3536995403001149E-2,8.6367071611827009E-2,8.7825451910357913E-2,8.8277495900537101E-2,8.7825451910357913E-2,8.6367071611827009E-2,8.3536995403001177E-2,7.8461391915376238E-2,6.896243549340271E-2,4.8523029405535482E-2,2.1848763102310215E-3,0,0,0,0,0,1.0000000000000002]
["Uppmätt IDN fördelad",{"$f":"B55*Ort!$I10","v":0},{"$f":"C55*Ort!$I10","v":0},{"$f":"D55*Ort!$I10","v":0},{"$f":"E55*Ort!$I10","v":0},{"$f":"F55*Ort!$I10","v":0.29422103721905613},{"$f":"G55*Ort!$I10","v":6.5342353587046791},{"$f":"H55*Ort!$I10","v":9.2866581073764749},{"$f":"I55*Ort!$I10","v":10.565811896487869},{"$f":"J55*Ort!$I10","v":11.249305655676364},{"$f":"K55*Ort!$I10","v":11.630410962951951},{"$f":"L55*Ort!$I10","v":11.826800187405686},{"$f":"M55*Ort!$I10","v":11.887673588355829},{"$f":"N55*Ort!$I10","v":11.826800187405686},{"$f":"O55*Ort!$I10","v":11.630410962951951},{"$f":"P55*Ort!$I10","v":11.24930565567637},{"$f":"Q55*Ort!$I10","v":10.565811896487867},{"$f":"R55*Ort!$I10","v":9.2866581073764713},{"$f":"S55*Ort!$I10","v":6.5342353587046853},{"$f":"T55*Ort!$I10","v":0.29422103721906351},{"$f":"U55*Ort!$I10","v":0},{"$f":"V55*Ort!$I10","v":0},{"$f":"W55*Ort!$I10","v":0},{"$f":"X55*Ort!$I10","v":0},{"$f":"Y55*Ort!$I10","v":0},134.66256000000001]
["Direktstr, IDH",{"$f":"IF(B52<0,0,B56*SIN(B52*PI()/180))","v":0},0,0,0,9.7483527333135506E-3,1.0630144051955321,2.7138855926437326,4.363228948042388,5.8116606098242078,6.9337040282959466,7.6421827680828827,7.8842704990367292,7.6421827680828835,6.9337040282959483,5.8116606098242158,4.3632289480423836,2.7138855926437295,1.0630144051955348,9.7483527333138576E-3,0,0,0,0,0,64.959119908672733]
["Global, IdH",{"$f":"IF(B52<0,0,244*SIN(B52*PI()/180))","v":0},0,0,0,8.0843915493288492,39.694853434102114,71.305315318875458,100.76157646495963,126.05624135402221,145.4655203752838,157.66670323879549,161.82829949581711,157.66670323879552,145.46552037528383,126.0562413540223,100.76157646495956,71.305315318875415,39.694853434102164,8.0843915493289025,0,0,0,0,0,1459.8975029665526]
["andel,%",{"$f":"B58/$Z58","v":0},0,0,0,5.5376432474890458E-3,2.7190164620078505E-2,4.8842685992668021E-2,6.9019623816198944E-2,8.634595312196397E-2,9.9640913200888276E-2,0.10799847449455345,0.11084908301231934,0.10799847449455346,9.9640913200888304E-2,8.6345953121964039E-2,6.9019623816198888E-2,4.8842685992667993E-2,2.719016462007854E-2,5.5376432474890823E-3,0,0,0,0,0,0.99999999999999978]
["Global, IDH + IdH fördelad",{"$f":"B59*Ort!$O10","v":0},{"$f":"C59*Ort!$O10","v":0},{"$f":"D59*Ort!$O10","v":0},{"$f":"E59*Ort!$O10","v":0},{"$f":"F59*Ort!$O10","v":0.65335031058439386},{"$f":"G59*Ort!$O10","v":3.207989699846447},{"$f":"H59*Ort!$O10","v":5.7626290891085068},{"$f":"I59*Ort!$O10","v":8.1431740257335541},{"$f":"J59*Ort!$O10","v":10.187394306327109},{"$f":"K59*Ort!$O10","v":11.755979697000472},{"$f":"L59*Ort!$O10","v":12.742033695589164},{"$f":"M59*Ort!$O10","v":13.078358351620656},{"$f":"N59*Ort!$O10","v":12.742033695589166},{"$f":"O59*Ort!$O10","v":11.755979697000475},{"$f":"P59*Ort!$O10","v":10.187394306327118},{"$f":"Q59*Ort!$O10","v":8.143174025733547},{"$f":"R59*Ort!$O10","v":5.7626290891085032},{"$f":"S59*Ort!$O10","v":3.207989699846451},{"$f":"T59*Ort!$O10","v":0.65335031058439808},{"$f":"U59*Ort!$O10","v":0},{"$f":"V59*Ort!$O10","v":0},{"$f":"W59*Ort!$O10","v":0},{"$f":"X59*Ort!$O10","v":0},{"$f":"Y59*Ort!$O10","v":0},117.98345999999995,null,{"$f":"Z57+Z61","v":117.98345999999995}]
["Diffusstrål, IdH fördelad",{"$f":"B60-B57","v":0},0,0,0,0.64360195785108032,2.1449752946509149,3.0487434964647742,3.7799450776911661,4.375733696502901,4.822275668704525,5.0998509275062816,5.1940878525839267,5.0998509275062824,4.8222756687045267,4.3757336965029019,3.7799450776911634,3.0487434964647737,2.1449752946509162,0.64360195785108421,0,0,0,0,0,53.024340091327218]
[]
["Maj","deklination",19.899999999999999]
["Kl",1,2,3,4,5,6,7,8,9,10,11,12,13,14,15,16,17,18,19,20,21,22,23,24]
["solhöjd",{"$f":"ASIN(SIN($C$8*PI()/180)*SIN($C63*PI()/180)+COS($C$8*PI()/180)*COS($C63*PI()/180)*COS((B64+12)*15*PI()/180))*180/PI()","v":-9.7957327703534514},-7.0221634227187373,-2.6412789840740927,3.0487002796175067,9.7171337135258682,17.02791296217702,24.63845678089859,32.173873308672,39.179929280617458,45.066612242610944,49.096302966539014,50.546735000000012,49.096302966539028,45.066612242610979,39.179929280617486,32.173873308671979,24.638456780898576,17.027912962177037,9.7171337135258806,3.0487002796175409,-2.6412789840740989,-7.0221634227187426,-9.7957327703534496,-10.746735000000012]
["azimut",{"$f":"-(180+ASIN((SIN((B64*15-180)*PI()/180)*(COS($C63*PI()/180))/(COS(B65*PI()/180))))*180/PI())","v":-165.70200608037672},-151.72543495471905,-138.27230213382293,-125.36638209450021,-112.85822682976811,-100.45487398239898,{"$f":"(ASIN((SIN((H64*15-180)*PI()/180)*(COS($C63*PI()/180))/(COS(H65*PI()/180))))*180/PI())","v":-87.738566648820495},-74.164584879818065,-59.062815076000632,-41.732860268174782,-21.8185371931928,0,21.81853719319281,41.732860268174811,59.062815076000653,74.164584879818008,87.738566648820495,{"$f":"(180-ASIN((SIN((S64*15-180)*PI()/180)*(COS($C63*PI()/180))/(COS(S65*PI()/180))))*180/PI())","v":100.45487398239898},112.85822682976811,125.36638209450021,138.2723021338229,151.72543495471905,165.70200608037672,180,"Summa"]
["Direktstr, IDN",{"$f":"IF(B65<0,0,1071*EXP(-0.129/SIN(B65*PI()/180)))","v":0},0,0,94.712015988362324,498.72669212246188,689.40630718800821,785.96687763849934,840.5783470748753,873.19237684853022,892.58901853194584,902.95302419900474,906.21864458518053,902.95302419900486,892.58901853194584,873.19237684853033,840.57834707487518,785.96687763849923,689.40630718800867,498.7266921224624,94.712015988364897,0,0,0,0,{"$f":"SUM(B67:Y67)","v":12062.46796376856}]
["andel,%",{"$f":"B67/$Z67","v":0},0,0,7.8517941993996691E-3,4.1345327806918339E-2,5.7153006271912506E-2,6.5158048916628769E-2,6.9685436645276821E-2,7.2389197589688536E-2,7.3997213606118703E-2,7.4856408067665775E-2,7.5127133792781436E-2,7.4856408067665775E-2,7.3997213606118703E-2,7.2389197589688536E-2,6.9685436645276808E-2,6.5158048916628769E-2,5.7153006271912547E-2,4.134532780691838E-2,7.8517941993998825E-3,0,0,0,0,1]
["Uppmätt IDN fördelad",{"$f":"B68*Ort!$I11","v":0},{"$f":"C68*Ort!$I11","v":0},{"$f":"D68*Ort!$I11","v":0},{"$f":"E68*Ort!$I11","v":1.3259396315853433},{"$f":"F68*Ort!$I11","v":6.9820231310026033},{"$f":"G68*Ort!$I11","v":9.6514801783735713},{"$f":"H68*Ort!$I11","v":11.003299014375614},{"$f":"I68*Ort!$I11","v":11.767843100035243},{"$f":"J68*Ort!$I11","v":12.224429671140509},{"$f":"K68*Ort!$I11","v":12.495976799129645},{"$f":"L68*Ort!$I11","v":12.64106974971806},{"$f":"M68*Ort!$I11","v":12.686787449278752},{"$f":"N68*Ort!$I11","v":12.64106974971806},{"$f":"O68*Ort!$I11","v":12.495976799129645},{"$f":"P68*Ort!$I11","v":12.224429671140509},{"$f":"Q68*Ort!$I11","v":11.76784310003524},{"$f":"R68*Ort!$I11","v":11.003299014375614},{"$f":"S68*Ort!$I11","v":9.6514801783735784},{"$f":"T68*Ort!$I11","v":6.9820231310026104},{"$f":"U68*Ort!$I11","v":1.3259396315853795},{"$f":"V68*Ort!$I11","v":0},{"$f":"W68*Ort!$I11","v":0},{"$f":"X68*Ort!$I11","v":0},{"$f":"Y68*Ort!$I11","v":0},168.87091000000001]
["Direktstr, IDH",{"$f":"B69*SIN(B65*PI()/180)","v":0},0,0,7.0519771258937158E-2,1.178454745263676,2.8263158667893191,4.5871760587280423,6.2662630007407722,7.7228788042431917,8.8462567063489388,9.5542623518774175,9.7960161853505809,9.5542623518774192,8.8462567063489423,7.7228788042431979,6.266263000740766,4.5871760587280397,2.8263158667893236,1.1784547452636787,7.0519771258939865E-2,0,0,0,0,91.900270795851185]
["Global, IdH",{"$f":"IF(B65<0,0,244*SIN(B65*PI()/180))","v":0},0,0,12.977079632658343,41.183329308599184,71.452363653178637,101.7213979977582,129.92764767369897,154.14890337861715,172.73452656374022,184.41793772319662,188.40293169421915,184.41793772319667,172.7345265637403,154.14890337861726,129.92764767369889,101.72139799775815,71.452363653178708,41.183329308599234,12.977079632658487,0,0,0,0,1925.529303557114]
["andel,%",{"$f":"B71/$Z71","v":0},0,0,6.7394869601232347E-3,2.138805638144246E-2,3.7107907691241872E-2,5.2827759001041349E-2,6.7476328422360538E-2,8.0055340157042104E-2,8.9707555343167308E-2,9.5775191466841533E-2,9.7844749153479113E-2,9.5775191466841561E-2,8.9707555343167364E-2,8.0055340157042174E-2,6.7476328422360482E-2,5.2827759001041315E-2,3.7107907691241913E-2,2.1388056381442484E-2,6.7394869601233092E-3,0,0,0,0,1.0000000000000002]
["Global, IDH + IdH fördelad",{"$f":"B72*Ort!$O11","v":0},{"$f":"C72*Ort!$O11","v":0},{"$f":"D72*Ort!$O11","v":0},{"$f":"E72*Ort!$O11","v":1.0824706506948063},{"$f":"F72*Ort!$O11","v":3.4352679136119111},{"$f":"G72*Ort!$O11","v":5.9601303811598898},{"$f":"H72*Ort!$O11","v":8.4849928487078792},{"$f":"I72*Ort!$O11","v":10.837790111624978},{"$f":"J72*Ort!$O11","v":12.858182924624703},{"$f":"K72*Ort!$O11","v":14.408484856358124},{"$f":"L72*Ort!$O11","v":15.383045392172685},{"$f":"M72*Ort!$O11","v":15.715449842090051},{"$f":"N72*Ort!$O11","v":15.38304539217269},{"$f":"O72*Ort!$O11","v":14.408484856358132},{"$f":"P72*Ort!$O11","v":12.858182924624716},{"$f":"Q72*Ort!$O11","v":10.837790111624969},{"$f":"R72*Ort!$O11","v":8.4849928487078721},{"$f":"S72*Ort!$O11","v":5.960130381159896},{"$f":"T72*Ort!$O11","v":3.4352679136119151},{"$f":"U72*Ort!$O11","v":1.0824706506948183},{"$f":"V72*Ort!$O11","v":0},{"$f":"W72*Ort!$O11","v":0},{"$f":"X72*Ort!$O11","v":0},{"$f":"Y72*Ort!$O11","v":0},160.61618000000004,null,{"$f":"Z70+Z74","v":160.61618000000004}]
["Diffusstrål, IdH fördelad",{"$f":"B73-B70","v":0},0,0,1.0119508794358691,2.2568131683482351,3.1338145143705707,3.8978167899798368,4.5715271108842055,5.1353041203815115,5.5622281500091848,5.8287830402952672,5.9194336567394696,5.8287830402952707,5.5622281500091901,5.1353041203815177,4.5715271108842028,3.8978167899798324,3.1338145143705725,2.2568131683482364,1.0119508794358785,0,0,0,0,68.715909204148844]
[]
["Juni","deklination",23.45]
["Kl",1,2,3,4,5,6,7,8,9,10,11,12,13,14,15,16,17,18,19,20,21,22,23,24]
["solhöjd",{"$f":"ASIN(SIN($C$8*PI()/180)*SIN($C76*PI()/180)+COS($C$8*PI()/180)*COS($C76*PI()/180)*COS((B77+12)*15*PI()/180))*180/PI()","v":-6.2773957936667992},-3.5904683233140564,0.66995235678519172,6.2314210671404107,12.787220364037859,20.0210748737248,27.606756688937775,35.18280056404322,42.302045542620405,48.361863859379277,52.567851086295448,54.096735000000002,52.56785108629547,48.361863859379305,42.302045542620434,35.182800564043205,27.606756688937757,20.021074873724814,12.787220364037871,6.2314210671404409,0.66995235678518539,-3.5904683233140626,-6.2773957936667966,-7.1967350000000119]
["azimut",{"$f":"-(180+ASIN((SIN((B77*15-180)*PI()/180)*(COS($C76*PI()/180))/(COS(B78*PI()/180))))*180/PI())","v":-166.17985811190209},-152.63831480285143,-139.55261015033997,-126.94427030010894,-114.67583985750626,-102.46828376327311,{"$f":"(ASIN((SIN((H77*15-180)*PI()/180)*(COS($C76*PI()/180))/(COS(H78*PI()/180))))*180/PI())","v":-89.907767246644823},-76.429023374740567,-61.293822820209357,-43.660071060218229,-22.994655248286637,0,22.994655248286644,43.660071060218264,61.293822820209421,76.42902337474051,89.907767246632972,{"$f":"(180-ASIN((SIN((S77*15-180)*PI()/180)*(COS($C76*PI()/180))/(COS(S78*PI()/180))))*180/PI())","v":102.46828376327306},114.67583985750625,126.94427030010893,139.55261015033997,152.63831480285143,166.17985811190209,180,"Summa"]
["Direktstr, IDN",{"$f":"IF(B78<0,0,1071*EXP(-0.129/SIN(B78*PI()/180)))","v":0},0,1.7313594237465552E-2,326.32563669017031,597.95205180590722,734.77039220311019,810.75927259592845,856.16440525982546,884.19719179222579,901.21114142222018,910.40962403518722,913.32375942993053,910.40962403518722,901.21114142222018,884.19719179222591,856.16440525982546,810.75927259592834,734.77039220311042,597.95205180590767,326.3256366901723,1.7313594237463738E-2,0,0,0,{"$f":"SUM(B80:Y80)","v":12956.937818227556}]
["andel,%",{"$f":"B80/$Z80","v":0},0,1.3362412076338857E-6,2.5185398067674759E-2,4.6149179705464081E-2,5.6708645399953232E-2,6.2573370650538182E-2,6.6077681105746355E-2,6.8241215956779178E-2,6.9554330974284276E-2,7.0264258176375716E-2,7.0489167443953102E-2,7.0264258176375716E-2,6.9554330974284276E-2,6.8241215956779178E-2,6.6077681105746355E-2,6.2573370650538182E-2,5.6708645399953253E-2,4.6149179705464123E-2,2.5185398067674915E-2,1.3362412076337455E-6,0,0,0,1.0000000000000002]
["Uppmätt IDN fördelad",{"$f":"B81*Ort!$I12","v":0},{"$f":"C81*Ort!$I12","v":0},{"$f":"D81*Ort!$I12","v":2.4922957670072928E-4},{"$f":"E81*Ort!$I12","v":4.6974648466055644},{"$f":"F81*Ort!$I12","v":8.6075331739283119},{"$f":"G81*Ort!$I12","v":10.57703624731689},{"$f":"H81*Ort!$I12","v":11.670897881967095},{"$f":"I81*Ort!$I12","v":12.324505783287533},{"$f":"J81*Ort!$I12","v":12.728038373077208},{"$f":"K81*Ort!$I12","v":12.972954558944329},{"$f":"L81*Ort!$I12","v":13.105366922112568},{"$f":"M81*Ort!$I12","v":13.147315966367563},{"$f":"N81*Ort!$I12","v":13.105366922112568},{"$f":"O81*Ort!$I12","v":12.972954558944329},{"$f":"P81*Ort!$I12","v":12.728038373077208},{"$f":"Q81*Ort!$I12","v":12.324505783287533},{"$f":"R81*Ort!$I12","v":11.670897881967095},{"$f":"S81*Ort!$I12","v":10.577036247316894},{"$f":"T81*Ort!$I12","v":8.607533173928319},{"$f":"U81*Ort!$I12","v":4.6974648466055937},{"$f":"V81*Ort!$I12","v":2.4922957670070315E-4},{"$f":"W81*Ort!$I12","v":0},{"$f":"X81*Ort!$I12","v":0},{"$f":"Y81*Ort!$I12","v":0},186.51540999999997]
["Direktstr, IDH",{"$f":"B82*SIN(B78*PI()/180)","v":0},0,2.9141437451413977E-6,0.50988412757520563,1.9051138236997645,3.6212150903655052,5.4083003662772748,7.1012199410432624,8.5664651874302873,9.6954156192095535,10.406627126267091,10.649434065511018,10.406627126267095,9.6954156192095589,8.5664651874302908,7.1012199410432579,5.4083003662772713,3.6212150903655087,1.9051138236997682,0.5098841275752114,2.9141437451410644E-6,0,0,0,105.07792245753441]
["Global, IdH",{"$f":"IF(B78<0,0,244*SIN(B78*PI()/180))","v":0},0,2.8529963547156338,26.484866026884983,54.004761130719523,83.537246293669739,113.06973145662003,140.58962656045449,164.22149623262382,182.35486760848084,193.75398139557407,197.64200682723919,193.75398139557413,182.35486760848093,164.22149623262391,140.58962656045441,113.06973145661998,83.537246293669781,54.004761130719587,26.484866026885115,2.8529963547156063,0,0,0,2119.3811529467257]
["andel,%",{"$f":"B84/$Z84","v":0},0,1.3461459496084086E-3,1.249650917677606E-2,2.5481382174052495E-2,3.9415867305190477E-2,5.3350352436328491E-2,6.6335225433604886E-2,7.7485588660772528E-2,8.6041563290746428E-2,9.1420073791910528E-2,9.325458356201928E-2,9.1420073791910555E-2,8.604156329074647E-2,7.748558866077257E-2,6.6335225433604844E-2,5.3350352436328463E-2,3.9415867305190498E-2,2.5481382174052526E-2,1.2496509176776121E-2,1.3461459496083956E-3,0,0,0,0.99999999999999989]
["Global, IDH + IdH fördelad",{"$f":"B85*Ort!$O12","v":0},{"$f":"C85*Ort!$O12","v":0},{"$f":"D85*Ort!$O12","v":0.23711934174086091},{"$f":"E85*Ort!$O12","v":2.2012204775550126},{"$f":"F85*Ort!$O12","v":4.4884646939778552},{"$f":"G85*Ort!$O12","v":6.9429800775099446},{"$f":"H85*Ort!$O12","v":9.3974954610420394},{"$f":"I85*Ort!$O12","v":11.684739677464876},{"$f":"J85*Ort!$O12","v":13.648840813279026},{"$f":"K85*Ort!$O12","v":15.155948621909351},{"$f":"L85*Ort!$O12","v":16.10335619681112},{"$f":"M85*Ort!$O12","v":16.426499277419804},{"$f":"N85*Ort!$O12","v":16.103356196811124},{"$f":"O85*Ort!$O12","v":15.155948621909358},{"$f":"P85*Ort!$O12","v":13.648840813279033},{"$f":"Q85*Ort!$O12","v":11.684739677464869},{"$f":"R85*Ort!$O12","v":9.3974954610420358},{"$f":"S85*Ort!$O12","v":6.9429800775099482},{"$f":"T85*Ort!$O12","v":4.4884646939778605},{"$f":"U85*Ort!$O12","v":2.2012204775550233},{"$f":"V85*Ort!$O12","v":0.23711934174085861},{"$f":"W85*Ort!$O12","v":0},{"$f":"X85*Ort!$O12","v":0},{"$f":"Y85*Ort!$O12","v":0},176.14682999999999,null,{"$f":"Z83+Z87","v":176.14682999999999}]
["Diffusstrål, IdH fördelad",{"$f":"B86-B83","v":0},0,0.23711642759711576,1.6913363499798071,2.5833508702780907,3.3217649871444395,3.9891950947647645,4.5835197364216134,5.0823756258487389,5.4605330026997976,5.6967290705440288,5.777065211908786,5.6967290705440288,5.4605330026997994,5.0823756258487425,4.5835197364216107,3.9891950947647645,3.3217649871444395,2.5833508702780925,1.691336349979812,0.23711642759711346,0,0,0,71.068907542465581]
[]
["Juli","deklination",19.899999999999999]
["Kl",1,2,3,4,5,6,7,8,9,10,11,12,13,14,15,16,17,18,19,20,21,22,23,24]
["solhöjd",{"$f":"ASIN(SIN($C$8*PI()/180)*SIN($C89*PI()/180)+COS($C$8*PI()/180)*COS($C89*PI()/180)*COS((B90+12)*15*PI()/180))*180/PI()","v":-9.7957327703534514},-7.0221634227187373,-2.6412789840740927,3.0487002796175067,9.7171337135258682,17.02791296217702,24.63845678089859,32.173873308672,39.179929280617458,45.066612242610944,49.096302966539014,50.546735000000012,49.096302966539028,45.066612242610979,39.179929280617486,32.173873308671979,24.638456780898576,17.027912962177037,9.7171337135258806,3.0487002796175409,-2.6412789840740989,-7.0221634227187426,-9.7957327703534496,-10.746735000000012]
["azimut",{"$f":"-(180+ASIN((SIN((B90*15-180)*PI()/180)*(COS($C89*PI()/180))/(COS(B91*PI()/180))))*180/PI())","v":-165.70200608037672},-151.72543495471905,-138.27230213382293,-125.36638209450021,-112.85822682976811,-100.45487398239898,{"$f":"(ASIN((SIN((H90*15-180)*PI()/180)*(COS($C89*PI()/180))/(COS(H91*PI()/180))))*180/PI())","v":-87.738566648820495},-74.164584879818065,-59.062815076000632,-41.732860268174782,-21.8185371931928,0,21.81853719319281,41.732860268174811,59.062815076000653,74.164584879818008,87.738566648820495,{"$f":"(180-ASIN((SIN((S90*15-180)*PI()/180)*(COS($C89*PI()/180))/(COS(S91*PI()/180))))*180/PI())","v":100.45487398239898},112.85822682976811,125.36638209450021,138.2723021338229,151.72543495471905,165.70200608037672,180,"Summa"]
["Direktstr, IDN",null,{"$f":"IF(C91<0,0,1071*EXP(-0.129/SIN(C91*PI()/180)))","v":0},0,94.712015988362324,498.72669212246188,689.40630718800821,785.96687763849934,840.5783470748753,873.19237684853022,892.58901853194584,902.95302419900474,906.21864458518053,902.95302419900486,892.58901853194584,873.19237684853033,840.57834707487518,785.96687763849923,689.40630718800867,498.7266921224624,94.712015988364897,0,0,0,0,{"$f":"SUM(B93:Y93)","v":12062.46796376856}]
["andel,%",{"$f":"B93/$Z93","v":0},0,0,7.8517941993996691E-3,4.1345327806918339E-2,5.7153006271912506E-2,6.5158048916628769E-2,6.9685436645276821E-2,7.2389197589688536E-2,7.3997213606118703E-2,7.4856408067665775E-2,7.5127133792781436E-2,7.4856408067665775E-2,7.3997213606118703E-2,7.2389197589688536E-2,6.9685436645276808E-2,6.5158048916628769E-2,5.7153006271912547E-2,4.134532780691838E-2,7.8517941993998825E-3,0,0,0,0,1]
["Uppmätt IDN fördelad",{"$f":"B94*Ort!$I13","v":0},{"$f":"C94*Ort!$I13","v":0},{"$f":"D94*Ort!$I13","v":0},{"$f":"E94*Ort!$I13","v":1.4361006182746887},{"$f":"F94*Ort!$I13","v":7.5620997339467797},{"$f":"G94*Ort!$I13","v":10.453339142488753},{"$f":"H94*Ort!$I13","v":11.917469046997871},{"$f":"I94*Ort!$I13","v":12.745532563585941},{"$f":"J94*Ort!$I13","v":13.24005300889174},{"$f":"K94*Ort!$I13","v":13.534160665912035},{"$f":"L94*Ort!$I13","v":13.691308149163731},{"$f":"M94*Ort!$I13","v":13.740824141476825},{"$f":"N94*Ort!$I13","v":13.691308149163731},{"$f":"O94*Ort!$I13","v":13.534160665912035},{"$f":"P94*Ort!$I13","v":13.24005300889174},{"$f":"Q94*Ort!$I13","v":12.74553256358594},{"$f":"R94*Ort!$I13","v":11.917469046997871},{"$f":"S94*Ort!$I13","v":10.453339142488762},{"$f":"T94*Ort!$I13","v":7.5620997339467868},{"$f":"U94*Ort!$I13","v":1.4361006182747276},{"$f":"V94*Ort!$I13","v":0},{"$f":"W94*Ort!$I13","v":0},{"$f":"X94*Ort!$I13","v":0},{"$f":"Y94*Ort!$I13","v":0},182.90094999999999]
["Direktstr, IDH",{"$f":"B95*SIN(B91*PI()/180)","v":0},0,0,7.637865608139556E-2,1.2763624738016413,3.061130286061938,4.9682852953099772,6.7868732144887343,8.3645067704730405,9.5812165371471743,10.348044318039227,10.609883410446459,10.34804431803923,9.5812165371471778,8.3645067704730476,6.7868732144887298,4.9682852953099745,3.0611302860619434,1.2763624738016441,7.6378656081398474E-2,0,0,0,0,99.535478513252727]
["Global, IdH",{"$f":"IF(B91<0,0,244*SIN(B91*PI()/180))","v":0},0,0,12.977079632658343,41.183329308599184,71.452363653178637,101.7213979977582,129.92764767369897,154.14890337861715,172.73452656374022,184.41793772319662,188.40293169421915,184.41793772319667,172.7345265637403,154.14890337861726,129.92764767369889,101.72139799775815,71.452363653178708,41.183329308599234,12.977079632658487,0,0,0,0,1925.529303557114]
["andel,%",{"$f":"B97/$Z97","v":0},0,0,6.7394869601232347E-3,2.138805638144246E-2,3.7107907691241872E-2,5.2827759001041349E-2,6.7476328422360538E-2,8.0055340157042104E-2,8.9707555343167308E-2,9.5775191466841533E-2,9.7844749153479113E-2,9.5775191466841561E-2,8.9707555343167364E-2,8.0055340157042174E-2,6.7476328422360482E-2,5.2827759001041315E-2,3.7107907691241913E-2,2.1388056381442484E-2,6.7394869601233092E-3,0,0,0,0,1.0000000000000002]
["Global, IDH + IdH fördelad",{"$f":"B98*Ort!$O13","v":0},{"$f":"C98*Ort!$O13","v":0},{"$f":"D98*Ort!$O13","v":0},{"$f":"E98*Ort!$O13","v":1.1432351456297998},{"$f":"F98*Ort!$O13","v":3.6281066936777089},{"$f":"G98*Ort!$O13","v":6.2947023274065872},{"$f":"H98*Ort!$O13","v":8.9612979611354771},{"$f":"I98*Ort!$O13","v":11.446169509183379},{"$f":"J98*Ort!$O13","v":13.579977081995224},{"$f":"K98*Ort!$O13","v":15.217305219767635},{"$f":"L98*Ort!$O13","v":16.246572715724106},{"$f":"M98*Ort!$O13","v":16.597636690960158},{"$f":"N98*Ort!$O13","v":16.24657271572411},{"$f":"O98*Ort!$O13","v":15.217305219767644},{"$f":"P98*Ort!$O13","v":13.579977081995237},{"$f":"Q98*Ort!$O13","v":11.44616950918337},{"$f":"R98*Ort!$O13","v":8.9612979611354717},{"$f":"S98*Ort!$O13","v":6.2947023274065943},{"$f":"T98*Ort!$O13","v":3.6281066936777129},{"$f":"U98*Ort!$O13","v":1.1432351456298124},{"$f":"V98*Ort!$O13","v":0},{"$f":"W98*Ort!$O13","v":0},{"$f":"X98*Ort!$O13","v":0},{"$f":"Y98*Ort!$O13","v":0},169.63237000000001,null,{"$f":"Z96+Z100","v":169.63237000000004}]
["Diffusstrål, IdH fördelad",{"$f":"B99-B96","v":0},0,0,1.0668564895484043,2.3517442198760676,3.2335720413446492,3.9930126658254999,4.659296294694645,5.2154703115221839,5.6360886826204606,5.8985283976848795,5.987753280513699,5.8985283976848795,5.6360886826204659,5.2154703115221892,4.6592962946946406,3.9930126658254972,3.2335720413446509,2.3517442198760685,1.0668564895484141,0,0,0,0,70.096891486747296]
[]
["Augusti","deklination",10.9]
["Kl",1,2,3,4,5,6,7,8,9,10,11,12,13,14,15,16,17,18,19,20,21,22,23,24]
["solhöjd",{"$f":"ASIN(SIN($C$8*PI()/180)*SIN($C102*PI()/180)+COS($C$8*PI()/180)*COS($C102*PI()/180)*COS((B103+12)*15*PI()/180))*180/PI()","v":-18.711757746754959},-15.712026703287291,-11.026108858971339,-5.0249553163656646,1.898714370648481,9.362709526604819,16.99180362973674,24.390742426483413,31.106063294891477,36.596095571113672,40.253831197620123,41.54673500000002,40.25383119762013,36.596095571113686,31.106063294891509,24.390742426483396,16.991803629736726,9.3627095266048332,1.8987143706484935,-5.0249553163656291,-11.026108858971348,-15.712026703287293,-18.711757746754955,-19.746735000000008]
["azimut",{"$f":"-(180+ASIN((SIN((B103*15-180)*PI()/180)*(COS($C102*PI()/180))/(COS(B104*PI()/180))))*180/PI())","v":-164.43493665761847},-149.33371070764619,-134.97556086906044,-121.38554696778294,-108.3737854295355,-95.60625591273444,{"$f":"(ASIN((SIN((H103*15-180)*PI()/180)*(COS($C102*PI()/180))/(COS(H104*PI()/180))))*180/PI())","v":-82.655077034112836},-69.025020456195904,-54.189333923916855,-37.7008944590021,-19.451569208746974,0,19.451569208746978,37.7008944590021,54.189333923916898,69.025020456195904,82.655077034112836,{"$f":"(180-ASIN((SIN((S103*15-180)*PI()/180)*(COS($C102*PI()/180))/(COS(S104*PI()/180))))*180/PI())","v":95.606255912734383},108.3737854295355,121.38554696778294,134.97556086906044,149.33371070764619,164.43493665761847,180,"Summa"]
["Direktstr, IDN",{"$f":"IF(B104<0,0,1071*EXP(-0.129/SIN(B104*PI()/180)))","v":0},0,0,0,21.822021658886811,484.63640421386651,688.78030025760768,783.65360352264031,834.34751636348369,862.61364018756854,877.1795935609523,881.69450074277677,877.1795935609523,862.61364018756854,834.34751636348392,783.6536035226402,688.78030025760745,484.63640421386702,21.822021658887362,0,0,0,0,0,{"$f":"SUM(B106:Y106)","v":9987.7606602727883}]
["andel,%",{"$f":"B106/$Z106","v":0},0,0,0,2.1848763102309664E-3,4.8523029405535434E-2,6.8962435493402738E-2,7.8461391915376252E-2,8.3536995403001149E-2,8.6367071611827009E-2,8.7825451910357913E-2,8.8277495900537101E-2,8.7825451910357913E-2,8.6367071611827009E-2,8.3536995403001177E-2,7.8461391915376238E-2,6.896243549340271E-2,4.8523029405535482E-2,2.1848763102310215E-3,0,0,0,0,0,1.0000000000000002]
["Uppmätt IDN fördelad",{"$f":"B107*Ort!$I14","v":0},{"$f":"C107*Ort!$I14","v":0},{"$f":"D107*Ort!$I14","v":0},{"$f":"E107*Ort!$I14","v":0},{"$f":"F107*Ort!$I14","v":0.31475900562780579},{"$f":"G107*Ort!$I14","v":6.9903547464984763},{"$f":"H107*Ort!$I14","v":9.9349091387605899},{"$f":"I107*Ort!$I14","v":11.303353688175919},{"$f":"J107*Ort!$I14","v":12.034558424684301},{"$f":"K107*Ort!$I14","v":12.44226661812742},{"$f":"L107*Ort!$I14","v":12.652364704890164},{"$f":"M107*Ort!$I14","v":12.717487346470632},{"$f":"N107*Ort!$I14","v":12.652364704890164},{"$f":"O107*Ort!$I14","v":12.44226661812742},{"$f":"P107*Ort!$I14","v":12.034558424684304},{"$f":"Q107*Ort!$I14","v":11.303353688175918},{"$f":"R107*Ort!$I14","v":9.9349091387605863},{"$f":"S107*Ort!$I14","v":6.9903547464984834},{"$f":"T107*Ort!$I14","v":0.31475900562781373},{"$f":"U107*Ort!$I14","v":0},{"$f":"V107*Ort!$I14","v":0},{"$f":"W107*Ort!$I14","v":0},{"$f":"X107*Ort!$I14","v":0},{"$f":"Y107*Ort!$I14","v":0},144.06262000000001]
["Direktstr, IDH",{"$f":"B108*SIN(B104*PI()/180)","v":0},0,0,0,1.0428832152346659E-2,1.1372176521091681,2.9033271672282841,4.6678022006623827,6.2173409892257601,7.4177081485816707,8.1756419311267532,8.4346284882742371,8.175641931126755,7.4177081485816716,6.2173409892257672,4.6678022006623792,2.903327167228281,1.1372176521091708,1.042883215234699E-2,0,0,0,0,0,69.493562330446977]
["Global, IdH",{"$f":"IF(B104<0,0,244*SIN(B104*PI()/180))","v":0},0,0,0,8.0843915493288492,39.694853434102114,71.305315318875458,100.76157646495963,126.05624135402221,145.4655203752838,157.66670323879549,161.82829949581711,157.66670323879552,145.46552037528383,126.0562413540223,100.76157646495956,71.305315318875415,39.694853434102164,8.0843915493289025,0,0,0,0,0,1459.8975029665526]
["andel,%",{"$f":"B110/$Z110","v":0},0,0,0,5.5376432474890458E-3,2.7190164620078505E-2,4.8842685992668021E-2,6.9019623816198944E-2,8.634595312196397E-2,9.9640913200888276E-2,0.10799847449455345,0.11084908301231934,0.10799847449455346,9.9640913200888304E-2,8.6345953121964039E-2,6.9019623816198888E-2,4.8842685992667993E-2,2.719016462007854E-2,5.5376432474890823E-3,0,0,0,0,0,0.99999999999999978]
["Global, IDH + IdH fördelad",{"$f":"B111*Ort!$O14","v":0},{"$f":"C111*Ort!$O14","v":0},{"$f":"D111*Ort!$O14","v":0},{"$f":"E111*Ort!$O14","v":0},{"$f":"F111*Ort!$O14","v":0.73097799040347999},{"$f":"G111*Ort!$O14","v":3.5891463217203396},{"$f":"H111*Ort!$O14","v":6.447314653037207},{"$f":"I111*Ort!$O14","v":9.1107035359213207},{"$f":"J111*Ort!$O14","v":11.397807419462366},{"$f":"K111*Ort!$O14","v":13.152763953614903},{"$f":"L111*Ort!$O14","v":14.255975750779228},{"$f":"M111*Ort!$O14","v":14.632260750122294},{"$f":"N111*Ort!$O14","v":14.25597575077923},{"$f":"O111*Ort!$O14","v":13.152763953614906},{"$f":"P111*Ort!$O14","v":11.397807419462374},{"$f":"Q111*Ort!$O14","v":9.1107035359213118},{"$f":"R111*Ort!$O14","v":6.4473146530372034},{"$f":"S111*Ort!$O14","v":3.5891463217203445},{"$f":"T111*Ort!$O14","v":0.73097799040348477},{"$f":"U111*Ort!$O14","v":0},{"$f":"V111*Ort!$O14","v":0},{"$f":"W111*Ort!$O14","v":0},{"$f":"X111*Ort!$O14","v":0},{"$f":"Y111*Ort!$O14","v":0},132.00164000000001,null,{"$f":"Z109+Z113","v":132.00163999999998}]
["Diffusstrål, IdH fördelad",{"$f":"B112-B109","v":0},0,0,0,0.7205491582511333,2.4519286696111715,3.5439874858089229,4.4429013352589379,5.1804664302366055,5.7350558050332321,6.0803338196524752,6.1976322618480566,6.0803338196524752,5.7350558050332348,5.1804664302366072,4.4429013352589326,3.5439874858089224,2.4519286696111737,0.72054915825113774,0,0,0,0,0,62.508077669553003]
[]
["September","deklination",0]
["Kl",1,2,3,4,5,6,7,8,9,10,11,12,13,14,15,16,17,18,19,20,21,22,23,24]
["solhöjd",{"$f":"ASIN(SIN($C$8*PI()/180)*SIN($C115*PI()/180)+COS($C$8*PI()/180)*COS($C115*PI()/180)*COS((B116+12)*15*PI()/180))*180/PI()","v":-29.496754156026245},-26.196476812473012,-21.127402789816724,-14.765981014739745,-7.581208084653043,-5.3672789234552306E-15,7.5812080846530563,14.765981014739737,21.12740278981671,26.196476812473009,29.496754156026245,30.64673500000001,29.496754156026245,26.196476812473026,21.127402789816745,14.765981014739721,7.5812080846530465,8.9454648724253859E-15,-7.5812080846530288,-14.765981014739712,-21.127402789816731,-26.196476812473023,-29.496754156026245,-30.64673500000001]
["azimut",{"$f":"-(180+ASIN((SIN((B116*15-180)*PI()/180)*(COS($C115*PI()/180))/(COS(B117*PI()/180))))*180/PI())","v":-162.70076983452199},-146.13512059411954,-130.70628382281495,-116.41403889135285,-102.98126481840468,-90,{"$f":"(ASIN((SIN((H116*15-180)*PI()/180)*(COS($C115*PI()/180))/(COS(H117*PI()/180))))*180/PI())","v":-77.018735181595318},-63.585961108647133,-49.293716177185026,-33.864879405880451,-17.299230165478001,0,17.299230165478001,33.864879405880451,49.293716177185033,63.585961108647126,77.018735181595318,{"$f":"(180-ASIN((SIN((S116*15-180)*PI()/180)*(COS($C115*PI()/180))/(COS(S117*PI()/180))))*180/PI())","v":90},102.98126481840468,116.41403889135287,130.70628382281495,146.13512059411954,162.70076983452199,180,"Summa"]
["Direktstr, IDN",{"$f":"IF(B117<0,0,1071*EXP(-0.129/SIN(B117*PI()/180)))","v":0},0,0,0,0,0,402.85082410656577,645.6199368772352,748.78741194792212,799.6144669648636,824.14974494203693,831.54010871125081,824.14974494203693,799.61446696486371,748.78741194792258,645.61993687723486,402.8508241065652,0,0,0,0,0,0,0,{"$f":"SUM(B119:Y119)","v":7673.5848783884976}]
["andel,%",{"$f":"B119/$Z119","v":0},0,0,0,0,0,5.2498386411432653E-2,8.4135374418744885E-2,9.7579869619578943E-2,0.10420350848230765,0.1074008769047608,0.10836396832635017,0.1074008769047608,0.10420350848230768,9.7579869619578999E-2,8.4135374418744843E-2,5.2498386411432577E-2,0,0,0,0,0,0,0,1]
["Uppmätt IDN fördelad",{"$f":"B120*Ort!$I15","v":0},{"$f":"C120*Ort!$I15","v":0},{"$f":"D120*Ort!$I15","v":0},{"$f":"E120*Ort!$I15","v":0},{"$f":"F120*Ort!$I15","v":0},{"$f":"G120*Ort!$I15","v":0},{"$f":"H120*Ort!$I15","v":5.5144037344798171},{"$f":"I120*Ort!$I15","v":8.8375368199040096},{"$f":"J120*Ort!$I15","v":10.249739739107067},{"$f":"K120*Ort!$I15","v":10.945483387192271},{"$f":"L120*Ort!$I15","v":11.281333335628855},{"$f":"M120*Ort!$I15","v":11.382495967375977},{"$f":"N120*Ort!$I15","v":11.281333335628855},{"$f":"O120*Ort!$I15","v":10.945483387192274},{"$f":"P120*Ort!$I15","v":10.249739739107074},{"$f":"Q120*Ort!$I15","v":8.8375368199040061},{"$f":"R120*Ort!$I15","v":5.5144037344798091},{"$f":"S120*Ort!$I15","v":0},{"$f":"T120*Ort!$I15","v":0},{"$f":"U120*Ort!$I15","v":0},{"$f":"V120*Ort!$I15","v":0},{"$f":"W120*Ort!$I15","v":0},{"$f":"X120*Ort!$I15","v":0},{"$f":"Y120*Ort!$I15","v":0},105.03949]
["Direktstr, IDH",{"$f":"B121*SIN(B117*PI()/180)","v":0},0,0,0,0,0,0.72752236236086021,2.2524377505921507,3.6944466291595921,4.831891067162787,5.5546380749324067,5.8021514671684367,5.5546380749324067,4.8318910671627915,3.694446629159601,2.2524377505921471,0.7275223623608581,0,0,0,0,0,0,0,39.924023235584031]
["Global, IdH",{"$f":"IF(B117<0,0,244*SIN(B117*PI()/180))","v":0},0,0,0,0,0,32.191233171068355,62.188687000056454,87.948084581655166,107.71396554009586,120.13931775272351,124.37737400011288,120.13931775272351,107.71396554009593,87.948084581655309,62.188687000056383,32.191233171068305,3.8095186895457463E-14,0,0,0,0,0,0,944.7399500913117]
["andel,%",{"$f":"B123/$Z123","v":0},0,0,0,0,0,3.4074173710931757E-2,6.5826248793697931E-2,9.3092373804193149E-2,0.11401440738235427,0.12716654751512491,0.13165249758739583,0.12716654751512491,0.11401440738235435,9.3092373804193301E-2,6.5826248793697861E-2,3.4074173710931709E-2,4.0323463501014704E-17,0,0,0,0,0,0,0.99999999999999989]
["Global, IDH + IdH fördelad",{"$f":"B124*Ort!$O15","v":0},{"$f":"C124*Ort!$O15","v":0},{"$f":"D124*Ort!$O15","v":0},{"$f":"E124*Ort!$O15","v":0},{"$f":"F124*Ort!$O15","v":0},{"$f":"G124*Ort!$O15","v":0},{"$f":"H124*Ort!$O15","v":2.8185396639608995},{"$f":"I124*Ort!$O15","v":5.4450005076798833},{"$f":"J124*Ort!$O15","v":7.7003935650892741},{"$f":"K124*Ort!$O15","v":9.4310175265398826},{"$f":"L124*Ort!$O15","v":10.518933229050173},{"$f":"M124*Ort!$O15","v":10.890001015359763},{"$f":"N124*Ort!$O15","v":10.518933229050173},{"$f":"O124*Ort!$O15","v":9.4310175265398897},{"$f":"P124*Ort!$O15","v":7.7003935650892865},{"$f":"Q124*Ort!$O15","v":5.4450005076798771},{"$f":"R124*Ort!$O15","v":2.8185396639608955},{"$f":"S124*Ort!$O15","v":3.3354669794803291E-15},{"$f":"T124*Ort!$O15","v":0},{"$f":"U124*Ort!$O15","v":0},{"$f":"V124*Ort!$O15","v":0},{"$f":"W124*Ort!$O15","v":0},{"$f":"X124*Ort!$O15","v":0},{"$f":"Y124*Ort!$O15","v":0},82.717769999999987,null,{"$f":"Z122+Z126","v":82.717770000000002}]
["Diffusstrål, IdH fördelad",{"$f":"B125-B122","v":0},0,0,0,0,0,2.0910173016000391,3.1925627570877326,4.005946935929682,4.5991264593770955,4.9642951541177665,5.0878495481913264,4.9642951541177665,4.5991264593770982,4.0059469359296855,3.19256275708773,2.0910173016000373,3.3354669794803291E-15,0,0,0,0,0,0,42.793746764415964]
[]
["Oktober","deklination",-10.9]
["Kl",1,2,3,4,5,6,7,8,9,10,11,12,13,14,15,16,17,18,19,20,21,22,23,24]
["solhöjd",{"$f":"ASIN(SIN($C$8*PI()/180)*SIN($C128*PI()/180)+COS($C$8*PI()/180)*COS($C128*PI()/180)*COS((B129+12)*15*PI()/180))*180/PI()","v":-40.25383119762013},-36.596095571113672,-31.106063294891488,-24.390742426483417,-16.991803629736726,-9.3627095266048297,-1.8987143706484662,5.0249553163656548,11.02610885897133,15.712026703287284,18.711757746754955,19.746735000000008,18.711757746754959,15.712026703287302,11.026108858971359,5.0249553163656415,-1.8987143706484775,-9.3627095266048155,-16.991803629736712,-24.390742426483385,-31.106063294891491,-36.596095571113686,-40.253831197620123,-41.54673500000002]
["azimut",{"$f":"-(180+ASIN((SIN((B129*15-180)*PI()/180)*(COS($C128*PI()/180))/(COS(B130*PI()/180))))*180/PI())","v":-160.548430791253},{"$f":"-(180+ASIN((SIN((C129*15-180)*PI()/180)*(COS($C128*PI()/180))/(COS(C130*PI()/180))))*180/PI())","v":-142.29910554099791},{"$f":"-(180+ASIN((SIN((D129*15-180)*PI()/180)*(COS($C128*PI()/180))/(COS(D130*PI()/180))))*180/PI())","v":-125.81066607608309},{"$f":"-(180+ASIN((SIN((E129*15-180)*PI()/180)*(COS($C128*PI()/180))/(COS(E130*PI()/180))))*180/PI())","v":-110.97497954380407},{"$f":"-(180+ASIN((SIN((F129*15-180)*PI()/180)*(COS($C128*PI()/180))/(COS(F130*PI()/180))))*180/PI())","v":-97.344922965887164},{"$f":"(ASIN((SIN((G129*15-180)*PI()/180)*(COS($C128*PI()/180))/(COS(G130*PI()/180))))*180/PI())","v":-84.39374408726556},-71.626214570464498,-58.614453032217043,-45.024439130939548,-30.666289292353802,-15.565063342381514,0,15.565063342381514,30.666289292353802,45.024439130939548,58.614453032217043,71.626214570464498,84.39374408726556,{"$f":"(180-ASIN((SIN((T129*15-180)*PI()/180)*(COS($C128*PI()/180))/(COS(T130*PI()/180))))*180/PI())","v":97.344922965887207},110.9749795438041,125.81066607608311,142.29910554099791,160.548430791253,180,"Summa"]
["Direktstr, IDN",{"$f":"IF(B130<0,0,1071*EXP(-0.129/SIN(B130*PI()/180)))","v":0},0,0,0,0,0,0,245.56728336788711,545.58599963760082,665.13243516416742,716.39923181612437,731.09002348460547,716.39923181612437,665.13243516416787,545.58599963760184,245.56728336788618,0,0,0,0,0,0,0,0,{"$f":"SUM(B132:Y132)","v":5076.4599234561656}]
["andel,%",{"$f":"B132/$Z132","v":0},0,0,0,0,0,0,4.837372639016118E-2,0.10747371354527584,0.13102288704986578,0.14112181374779456,0.14401571853380521,0.14112181374779456,0.13102288704986587,0.10747371354527603,4.8373726390160993E-2,0,0,0,0,0,0,0,0,1]
["Uppmätt IDN fördelad",{"$f":"B133*Ort!$I16","v":0},{"$f":"C133*Ort!$I16","v":0},{"$f":"D133*Ort!$I16","v":0},{"$f":"E133*Ort!$I16","v":0},{"$f":"F133*Ort!$I16","v":0},{"$f":"G133*Ort!$I16","v":0},{"$f":"H133*Ort!$I16","v":0},{"$f":"I133*Ort!$I16","v":2.8383303308917629},{"$f":"J133*Ort!$I16","v":6.3060244412176019},{"$f":"K133*Ort!$I16","v":7.6877731385663575},{"$f":"L133*Ort!$I16","v":8.2803280665243957},{"$f":"M133*Ort!$I16","v":8.4501280455997616},{"$f":"N133*Ort!$I16","v":8.2803280665243957},{"$f":"O133*Ort!$I16","v":7.6877731385663619},{"$f":"P133*Ort!$I16","v":6.3060244412176134},{"$f":"Q133*Ort!$I16","v":2.8383303308917518},{"$f":"R133*Ort!$I16","v":0},{"$f":"S133*Ort!$I16","v":0},{"$f":"T133*Ort!$I16","v":0},{"$f":"U133*Ort!$I16","v":0},{"$f":"V133*Ort!$I16","v":0},{"$f":"W133*Ort!$I16","v":0},{"$f":"X133*Ort!$I16","v":0},{"$f":"Y133*Ort!$I16","v":0},58.67504000000001]
["Direktstr, IDH",{"$f":"B134*SIN(B130*PI()/180)","v":0},0,0,0,0,0,0,0.24860830206694379,1.206066832190541,2.0818682958551062,2.6563902049616197,2.8549863262392008,2.6563902049616197,2.0818682958551102,1.2060668321905463,0.24860830206694218,0,0,0,0,0,0,0,0,15.24085359638763]
["Global, IdH",{"$f":"IF(B130<0,0,244*SIN(B130*PI()/180))","v":0},0,0,0,0,0,0,21.371869596755374,46.666534485817941,66.075813507079516,78.276996370591277,82.438592627612849,78.276996370591277,66.075813507079587,46.666534485818062,21.371869596755317,0,0,0,0,0,0,0,0,507.22102054810125]
["andel,%",{"$f":"B136/$Z136","v":0},0,0,0,0,0,0,4.2135220605922459E-2,9.2004338533506064E-2,0.13027025858604643,0.15432522154938577,0.16252992145027823,0.15432522154938577,0.13027025858604657,9.20043385335063E-2,4.2135220605922348E-2,0,0,0,0,0,0,0,0,1]
["Global, IDH + IdH fördelad",{"$f":"B137*Ort!$O16","v":0},{"$f":"C137*Ort!$O16","v":0},{"$f":"D137*Ort!$O16","v":0},{"$f":"E137*Ort!$O16","v":0},{"$f":"F137*Ort!$O16","v":0},{"$f":"G137*Ort!$O16","v":0},{"$f":"H137*Ort!$O16","v":0},{"$f":"I137*Ort!$O16","v":1.6349384142907126},{"$f":"J137*Ort!$O16","v":3.5699689045580389},{"$f":"K137*Ort!$O16","v":5.0547700223023204},{"$f":"L137*Ort!$O16","v":5.9881550250991467},{"$f":"M137*Ort!$O16","v":6.3065152674995577},{"$f":"N137*Ort!$O16","v":5.9881550250991467},{"$f":"O137*Ort!$O16","v":5.0547700223023257},{"$f":"P137*Ort!$O16","v":3.5699689045580483},{"$f":"Q137*Ort!$O16","v":1.6349384142907084},{"$f":"R137*Ort!$O16","v":0},{"$f":"S137*Ort!$O16","v":0},{"$f":"T137*Ort!$O16","v":0},{"$f":"U137*Ort!$O16","v":0},{"$f":"V137*Ort!$O16","v":0},{"$f":"W137*Ort!$O16","v":0},{"$f":"X137*Ort!$O16","v":0},{"$f":"Y137*Ort!$O16","v":0},38.802180000000007,null,{"$f":"Z135+Z139","v":38.802180000000007}]
["Diffusstrål, IdH fördelad",{"$f":"B138-B135","v":0},0,0,0,0,0,0,1.3863301122237688,2.3639020723674982,2.9729017264472142,3.331764820137527,3.4515289412603569,3.331764820137527,2.9729017264472155,2.3639020723675017,1.3863301122237663,0,0,0,0,0,0,0,0,23.561326403612377]
[]
["November","deklination",-19.899999999999999]
["Kl",1,2,3,4,5,6,7,8,9,10,11,12,13,14,15,16,17,18,19,20,21,22,23,24]
["solhöjd",{"$f":"ASIN(SIN($C$8*PI()/180)*SIN($C141*PI()/180)+COS($C$8*PI()/180)*COS($C141*PI()/180)*COS((B142+12)*15*PI()/180))*180/PI()","v":-49.096302966539028},-45.066612242610958,-39.179929280617458,-32.173873308672007,-24.638456780898583,-17.027912962177034,-9.7171337135258558,-3.0487002796175164,2.641278984074086,7.022163422718732,9.7957327703534496,10.746735000000012,9.7957327703534514,7.0221634227187497,2.6412789840741113,-3.0487002796175284,-9.7171337135258646,-17.027912962177016,-24.638456780898565,-32.173873308671965,-39.179929280617479,-45.066612242610972,-49.096302966539014,-50.546735000000012]
["azimut",{"$f":"-(180+ASIN((SIN((B142*15-180)*PI()/180)*(COS($C141*PI()/180))/(COS(B143*PI()/180))))*180/PI())","v":-158.18146280680716},{"$f":"-(180+ASIN((SIN((C142*15-180)*PI()/180)*(COS($C141*PI()/180))/(COS(C143*PI()/180))))*180/PI())","v":-138.26713973182521},{"$f":"-(180+ASIN((SIN((D142*15-180)*PI()/180)*(COS($C141*PI()/180))/(COS(D143*PI()/180))))*180/PI())","v":-120.93718492399935},{"$f":"-(180+ASIN((SIN((E142*15-180)*PI()/180)*(COS($C141*PI()/180))/(COS(E143*PI()/180))))*180/PI())","v":-105.83541512018189},{"$f":"-(180+ASIN((SIN((F142*15-180)*PI()/180)*(COS($C141*PI()/180))/(COS(F143*PI()/180))))*180/PI())","v":-92.261433351179505},{"$f":"(ASIN((SIN((G142*15-180)*PI()/180)*(COS($C141*PI()/180))/(COS(G143*PI()/180))))*180/PI())","v":-79.545126017601021},-67.141773170231858,-54.633617905499761,-41.727697866177074,-28.274565045280941,-14.297993919623277,0,14.297993919623277,28.274565045280941,41.727697866177074,54.633617905499783,67.141773170231872,79.545126017600978,{"$f":"(180-ASIN((SIN((T142*15-180)*PI()/180)*(COS($C141*PI()/180))/(COS(T143*PI()/180))))*180/PI())","v":92.261433351179662},105.83541512018199,120.93718492399935,138.26713973182518,158.18146280680719,180,"Summa"]
["Direktstr, IDN",{"$f":"IF(B143<0,0,1071*EXP(-0.129/SIN(B143*PI()/180)))","v":0},0,0,0,0,0,0,0,65.172151083364341,372.84456607708654,501.76485674336857,536.2178682895393,501.76485674336857,372.84456607708756,65.172151083366117,0,0,0,0,0,0,0,0,0,{"$f":"SUM(B145:Y145)","v":2415.7810160971812}]
["andel,%",{"$f":"B145/$Z145","v":0},0,0,0,0,0,0,0,2.697767332763187E-2,0.1543370709483578,0.20770295544171283,0.22196460056459377,0.20770295544171283,0.15433707094835822,2.6977673327632606E-2,0,0,0,0,0,0,0,0,0,0.99999999999999989]
["Uppmätt IDN fördelad",{"$f":"B146*Ort!$I17","v":0},{"$f":"C146*Ort!$I17","v":0},{"$f":"D146*Ort!$I17","v":0},{"$f":"E146*Ort!$I17","v":0},{"$f":"F146*Ort!$I17","v":0},{"$f":"G146*Ort!$I17","v":0},{"$f":"H146*Ort!$I17","v":0},{"$f":"I146*Ort!$I17","v":0},{"$f":"J146*Ort!$I17","v":0.67726423737433361},{"$f":"K146*Ort!$I17","v":3.8745735180715624},{"$f":"L146*Ort!$I17","v":5.2143037692411331},{"$f":"M146*Ort!$I17","v":5.5723369506259122},{"$f":"N146*Ort!$I17","v":5.2143037692411331},{"$f":"O146*Ort!$I17","v":3.8745735180715726},{"$f":"P146*Ort!$I17","v":0.67726423737435204},{"$f":"Q146*Ort!$I17","v":0},{"$f":"R146*Ort!$I17","v":0},{"$f":"S146*Ort!$I17","v":0},{"$f":"T146*Ort!$I17","v":0},{"$f":"U146*Ort!$I17","v":0},{"$f":"V146*Ort!$I17","v":0},{"$f":"W146*Ort!$I17","v":0},{"$f":"X146*Ort!$I17","v":0},{"$f":"Y146*Ort!$I17","v":0},25.104619999999997]
["Direktstr, IDH",{"$f":"B147*SIN(B143*PI()/180)","v":0},0,0,0,0,0,0,0,3.1210157100335111E-2,0.47367930431166616,0.88714135061403909,1.0390628094164454,0.88714135061403909,0.47367930431166866,3.1210157100336259E-2,0,0,0,0,0,0,0,0,0,3.8231244334685295]
["Global, IdH",{"$f":"IF(B143<0,0,244*SIN(B143*PI()/180))","v":0},0,0,0,0,0,0,0,11.244176072259805,29.829799257382899,41.513210416839321,45.498204387861861,41.513210416839321,29.829799257382977,11.244176072259913,0,0,0,0,0,0,0,0,0,210.67257588082606]
["andel,%",{"$f":"B149/$Z149","v":0},0,0,0,0,0,0,0,5.337275639815809E-2,0.14159317667553045,0.19705085127132374,0.21596643130997473,0.19705085127132374,0.14159317667553081,5.3372756398158604E-2,0,0,0,0,0,0,0,0,0,1.0000000000000002]
["Global, IDH + IdH fördelad",{"$f":"B150*Ort!$O17","v":0},{"$f":"C150*Ort!$O17","v":0},{"$f":"D150*Ort!$O17","v":0},{"$f":"E150*Ort!$O17","v":0},{"$f":"F150*Ort!$O17","v":0},{"$f":"G150*Ort!$O17","v":0},{"$f":"H150*Ort!$O17","v":0},{"$f":"I150*Ort!$O17","v":0},{"$f":"J150*Ort!$O17","v":0.64623893565159007},{"$f":"K150*Ort!$O17","v":1.7144144309826228},{"$f":"L150*Ort!$O17","v":2.385897618718726},{"$f":"M150*Ort!$O17","v":2.6149280292941133},{"$f":"N150*Ort!$O17","v":2.385897618718726},{"$f":"O150*Ort!$O17","v":1.7144144309826272},{"$f":"P150*Ort!$O17","v":0.64623893565159629},{"$f":"Q150*Ort!$O17","v":0},{"$f":"R150*Ort!$O17","v":0},{"$f":"S150*Ort!$O17","v":0},{"$f":"T150*Ort!$O17","v":0},{"$f":"U150*Ort!$O17","v":0},{"$f":"V150*Ort!$O17","v":0},{"$f":"W150*Ort!$O17","v":0},{"$f":"X150*Ort!$O17","v":0},{"$f":"Y150*Ort!$O17","v":0},12.108030000000001,null,{"$f":"Z148+Z152","v":12.108030000000003}]
["Diffusstrål, IdH fördelad",{"$f":"B151-B148","v":0},0,0,0,0,0,0,0,0.61502877855125493,1.2407351266709568,1.4987562681046869,1.5758652198776679,1.4987562681046869,1.2407351266709585,0.61502877855126004,0,0,0,0,0,0,0,0,0,8.2849055665314726]
[]
["December","deklination",-23.45]
["Kl",1,2,3,4,5,6,7,8,9,10,11,12,13,14,15,16,17,18,19,20,21,22,23,24]
["solhöjd",{"$f":"ASIN(SIN($C$8*PI()/180)*SIN($C154*PI()/180)+COS($C$8*PI()/180)*COS($C154*PI()/180)*COS((B155+12)*15*PI()/180))*180/PI()","v":-52.56785108629547},-48.361863859379277,-42.302045542620426,-35.182800564043227,-27.606756688937757,-20.02107487372481,-12.787220364037843,-6.2314210671404169,-0.66995235678520138,3.5904683233140529,6.2773957936667966,7.1967350000000119,6.2773957936667992,3.5904683233140688,-0.66995235678517584,-6.2314210671404284,-12.787220364037854,-20.021074873724793,-27.606756688937743,-35.182800564043191,-42.302045542620426,-48.361863859379305,-52.567851086295441,-54.096735000000002]
["azimut",{"$f":"-(180+ASIN((SIN((B155*15-180)*PI()/180)*(COS($C154*PI()/180))/(COS(B156*PI()/180))))*180/PI())","v":-157.00534475171332},{"$f":"-(180+ASIN((SIN((C155*15-180)*PI()/180)*(COS($C154*PI()/180))/(COS(C156*PI()/180))))*180/PI())","v":-136.33992893978177},{"$f":"-(180+ASIN((SIN((D155*15-180)*PI()/180)*(COS($C154*PI()/180))/(COS(D156*PI()/180))))*180/PI())","v":-118.70617717979059},{"$f":"-(180+ASIN((SIN((E155*15-180)*PI()/180)*(COS($C154*PI()/180))/(COS(E156*PI()/180))))*180/PI())","v":-103.57097662525939},{"$f":"-(180+ASIN((SIN((F155*15-180)*PI()/180)*(COS($C154*PI()/180))/(COS(F156*PI()/180))))*180/PI())","v":-90.092232753370993},{"$f":"(ASIN((SIN((G155*15-180)*PI()/180)*(COS($C154*PI()/180))/(COS(G156*PI()/180))))*180/PI())","v":-77.531716236726936},-65.324160142493739,-53.055729699891067,-40.44738984966002,-27.361685197148589,-13.820141888097904,0,13.820141888097904,27.361685197148585,40.44738984966002,53.055729699891067,65.324160142493739,77.531716236726922,{"$f":"(180-ASIN((SIN((T155*15-180)*PI()/180)*(COS($C154*PI()/180))/(COS(T156*PI()/180))))*180/PI())","v":90.092232753370993},103.57097662525949,118.70617717979059,136.33992893978174,157.00534475171335,180,"Summa"]
["Direktstr, IDN",{"$f":"IF(B156<0,0,1071*EXP(-0.129/SIN(B156*PI()/180)))","v":0},0,0,0,0,0,0,0,0,136.51725038346331,329.16704113755003,382.46128831419014,329.16704113755026,136.5172503834645,0,0,0,0,0,0,0,0,0,0,{"$f":"SUM(B158:Y158)","v":1313.8298713562183}]
["andel,%",{"$f":"IF($Z158=0,0,B158/$Z158)","v":0},0,0,0,0,0,0,0,0,0.10390786003559317,0.25054008004686557,0.29110411983508139,0.25054008004686573,0.10390786003559407,0,0,0,0,0,0,0,0,0,0,1]
["Uppmätt IDN fördelad",{"$f":"B159*Ort!$I18","v":0},{"$f":"C159*Ort!$I18","v":0},{"$f":"D159*Ort!$I18","v":0},{"$f":"E159*Ort!$I18","v":0},{"$f":"F159*Ort!$I18","v":0},{"$f":"G159*Ort!$I18","v":0},{"$f":"H159*Ort!$I18","v":0},{"$f":"I159*Ort!$I18","v":0},{"$f":"J159*Ort!$I18","v":0},{"$f":"K159*Ort!$I18","v":1.7832656548522499},{"$f":"L159*Ort!$I18","v":4.2997663483635069},{"$f":"M159*Ort!$I18","v":4.995925993568469},{"$f":"N159*Ort!$I18","v":4.2997663483635096},{"$f":"O159*Ort!$I18","v":1.7832656548522654},{"$f":"P159*Ort!$I18","v":0},{"$f":"Q159*Ort!$I18","v":0},{"$f":"R159*Ort!$I18","v":0},{"$f":"S159*Ort!$I18","v":0},{"$f":"T159*Ort!$I18","v":0},{"$f":"U159*Ort!$I18","v":0},{"$f":"V159*Ort!$I18","v":0},{"$f":"W159*Ort!$I18","v":0},{"$f":"X159*Ort!$I18","v":0},{"$f":"Y159*Ort!$I18","v":0},17.161989999999999]
["Direktstr, IDH",{"$f":"B160*SIN(B156*PI()/180)","v":0},0,0,0,0,0,0,0,0,0.11167609823140839,0.47014577118519629,0.62587311045036564,0.47014577118519674,0.11167609823140984,0,0,0,0,0,0,0,0,0,0,1.7895168492835767]
["Global, IdH",{"$f":"IF(B156<0,0,244*SIN(B156*PI()/180))","v":0},0,0,0,0,0,0,0,0,15.280375021141383,26.679488808234591,30.567514239899694,26.679488808234602,15.280375021141447,0,0,0,0,0,0,0,0,0,0,114.48724189865172]
["andel,%",{"$f":"IF($Z162=0,0,B162/$Z162)","v":0},0,0,0,0,0,0,0,0,0.13346792854585604,0.23303460163580714,0.26699493963667298,0.23303460163580722,0.1334679285458566,0,0,0,0,0,0,0,0,0,0,1]
["Global, IDH + IdH fördelad",{"$f":"B163*Ort!$O18","v":0},{"$f":"C163*Ort!$O18","v":0},{"$f":"D163*Ort!$O18","v":0},{"$f":"E163*Ort!$O18","v":0},{"$f":"F163*Ort!$O18","v":0},{"$f":"G163*Ort!$O18","v":0},{"$f":"H163*Ort!$O18","v":0},{"$f":"I163*Ort!$O18","v":0},{"$f":"J163*Ort!$O18","v":0},{"$f":"K163*Ort!$O18","v":0.82671903492302878},{"$f":"L163*Ort!$O18","v":1.4434489473764185},{"$f":"M163*Ort!$O18","v":1.6538040354011017},{"$f":"N163*Ort!$O18","v":1.4434489473764189},{"$f":"O163*Ort!$O18","v":0.82671903492303223},{"$f":"P163*Ort!$O18","v":0},{"$f":"Q163*Ort!$O18","v":0},{"$f":"R163*Ort!$O18","v":0},{"$f":"S163*Ort!$O18","v":0},{"$f":"T163*Ort!$O18","v":0},{"$f":"U163*Ort!$O18","v":0},{"$f":"V163*Ort!$O18","v":0},{"$f":"W163*Ort!$O18","v":0},{"$f":"X163*Ort!$O18","v":0},{"$f":"Y163*Ort!$O18","v":0},6.19414,null,{"$f":"Z161+Z165","v":6.19414}]
["Diffusstrål, IdH fördelad",{"$f":"B164-B161","v":0},0,0,0,0,0,0,0,0,0.71504293669162045,0.9733031761912222,1.027930924950736,0.9733031761912222,0.71504293669162244,0,0,0,0,0,0,0,0,0,0,4.4046231507164233]
[]
[null,"Summa IDH",{"$f":"Z18+Z31+Z44+Z57+Z70+Z83+Z96+Z109+Z122+Z135+Z148+Z161","v":538.00920604801684}]
[null,"Summa IdH",{"$f":"Z22+Z35+Z48+Z61+Z74+Z87+Z100+Z113+Z126+Z139+Z152+Z165","v":457.41718395198319}]
[null,"Summa",{"$f":"SUM(C167:C168)","v":995.42639000000008}]

{"sheet":"Lutande yta","index":8,"n_rows":170,"n_cols":30,"rows_kept":170,"cut":false,"hidden":false,"merged":[[12,22,13,23],[12,20,13,21]]}
["SOLINSTRÅLNING MOT OLIKA YTOR",null,null,null,null,null,"PLATS",{"$f":"Ort!B1","v":"Stockholm Bromma"},null,null,"Latitud",{"$f":"Ort!C2","v":59.353265},"Longitud",{"$f":"Ort!C3","v":17.947934}]
["Direktstrålning, IDN","IDN*(sin(h*PI()/180)*cos(α*PI()/180)+cos(h*PI()/180)*sin(α*PI()/180)*cos ((a-β)*PI()/180))",null,null,null,null,null,null,null,null,"h","solhöjd",null,null,null,"Albedo (markreflektion)"]
["Diffusstrålning","IdH*(2+cos(α*PI()/180))/3 (enl Koronakis 1986)",null,null,null,null,null,null,null,null,"a","solazimut räknad från Norr medurs",null,null,null,"Torr ren snö",null,"0,8-0,9"]
["Markreflektion","r*(IDH + IdH)*(1-cos(α*PI()/180))/2",null,null,null,null,null,null,null,null,"α","ytans lutning mot horisontalplanet",null,null,null,"Smältande snö",null,0.6]
["Globbalstrålning","IDH + IdH",null,null,null,null,null,null,null,null,"β","ytans azimut",null,null,null,"Barmark",null,"0,5-0,2"]
[null,null,null,null,null,"Välj markreflektion (albedo)",null,null,null,null,"r","albedo = markens reflektionsfaktor",null,null,null,"Hav",null,0.1]
["Välj lutning","α",45,"hor=0","r",0.2,"sommar","maj-sep",null,"SKUGGNINGAR",null,"Vänster","Höger"]
["Välj orientering","β",180,"Öster=90","r",0.5,"vinter","nov-april",null,"Vertikal avskärmning",null,0,0]
[null,null,null,null,null,null,null,null,null,"Horisontell avskärmning",null,0]
[null,null,null,null,null,null,null,null,null,"Horisontavskärmning",null,5]
[null,null,null,null,null,null,null,null,null,null,null,"337,5-22,5","22,5-67,5","67,5-112,5","112,5-157,5","157,5-202,5","202,5-246,5","247,5-292,5","292,5-337,5"]
[null,"N","NO","NO","NO","O","O","O","SO","SO","SO","S","S","S","SV","SV","SV","V","V","V","NV","NV","NV","N","N"]
["Sammanställning","jan","feb","mar","apr","maj","jun","jul","aug","sep","okt","nov","dec","Summa",null,null,"Solen når ytan",null,null,null,{"$f":"Z162","v":1196.8357646529755},null,"kWh/m2,år"]
[null,{"$f":"Z27","v":20.041804418506693},{"$f":"Z39","v":37.038866296596886},{"$f":"Z51","v":101.9730039450647},{"$f":"Z63","v":144.73780950385432},{"$f":"Z75","v":164.73380367120808},{"$f":"Z87","v":171.54254333380496},{"$f":"Z99","v":174.38787730977293},{"$f":"Z111","v":154.68307175662784},{"$f":"Z123","v":116.91554828774875},{"$f":"Z135","v":66.754330879699864},{"$f":"Z147","v":26.724028210917165},{"$f":"Z159","v":17.303077039173296},{"$f":"SUM(B14:M14)","v":1196.8357646529755},null,null,"Solen når inte ytan"]
["Andel",{"$f":"B14/$N14","v":1.6745659689003232E-2},{"$f":"C14/$N14","v":3.0947325765566813E-2},8.520216971844248E-2,0.12093372689762599,0.13764111044841054,0.14333006114965491,0.14570744162239921,0.12924335679547347,9.7687211345700894E-2,5.5775681886524667E-2,2.2328901759270072E-2,1.4457352921927723E-2]
[]
["Januari","deklination",null,-19.899999999999999]
["Kl",{"$f":"'Mot marken'!B12","v":1},{"$f":"'Mot marken'!C12","v":2},{"$f":"'Mot marken'!D12","v":3},{"$f":"'Mot marken'!E12","v":4},{"$f":"'Mot marken'!F12","v":5},{"$f":"'Mot marken'!G12","v":6},{"$f":"'Mot marken'!H12","v":7},{"$f":"'Mot marken'!I12","v":8},{"$f":"'Mot marken'!J12","v":9},{"$f":"'Mot marken'!K12","v":10},{"$f":"'Mot marken'!L12","v":11},{"$f":"'Mot marken'!M12","v":12},{"$f":"'Mot marken'!N12","v":13},{"$f":"'Mot marken'!O12","v":14},{"$f":"'Mot marken'!P12","v":15},{"$f":"'Mot marken'!Q12","v":16},{"$f":"'Mot marken'!R12","v":17},{"$f":"'Mot marken'!S12","v":18},{"$f":"'Mot marken'!T12","v":19},{"$f":"'Mot marken'!U12","v":20},{"$f":"'Mot marken'!V12","v":21},{"$f":"'Mot marken'!W12","v":22},{"$f":"'Mot marken'!X12","v":23},{"$f":"'Mot marken'!Y12","v":24}]
["solhöjd",{"$f":"IF('Mot marken'!B13<0,0,'Mot marken'!B13)","v":0},{"$f":"IF('Mot marken'!C13<0,0,'Mot marken'!C13)","v":0},{"$f":"IF('Mot marken'!D13<0,0,'Mot marken'!D13)","v":0},{"$f":"IF('Mot marken'!E13<0,0,'Mot marken'!E13)","v":0},{"$f":"IF('Mot marken'!F13<0,0,'Mot marken'!F13)","v":0},{"$f":"IF('Mot marken'!G13<0,0,'Mot marken'!G13)","v":0},{"$f":"IF('Mot marken'!H13<0,0,'Mot marken'!H13)","v":0},{"$f":"IF('Mot marken'!I13<0,0,'Mot marken'!I13)","v":0},{"$f":"IF('Mot marken'!J13<0,0,'Mot marken'!J13)","v":2.641278984074086},{"$f":"IF('Mot marken'!K13<0,0,'Mot marken'!K13)","v":7.022163422718732},{"$f":"IF('Mot marken'!L13<0,0,'Mot marken'!L13)","v":9.7957327703534496},{"$f":"IF('Mot marken'!M13<0,0,'Mot marken'!M13)","v":10.746735000000012},{"$f":"IF('Mot marken'!N13<0,0,'Mot marken'!N13)","v":9.7957327703534514},{"$f":"IF('Mot marken'!O13<0,0,'Mot marken'!O13)","v":7.0221634227187497},{"$f":"IF('Mot marken'!P13<0,0,'Mot marken'!P13)","v":2.6412789840741113},{"$f":"IF('Mot marken'!Q13<0,0,'Mot marken'!Q13)","v":0},{"$f":"IF('Mot marken'!R13<0,0,'Mot marken'!R13)","v":0},{"$f":"IF('Mot marken'!S13<0,0,'Mot marken'!S13)","v":0},{"$f":"IF('Mot marken'!T13<0,0,'Mot marken'!T13)","v":0},{"$f":"IF('Mot marken'!U13<0,0,'Mot marken'!U13)","v":0},{"$f":"IF('Mot marken'!V13<0,0,'Mot marken'!V13)","v":0},{"$f":"IF('Mot marken'!W13<0,0,'Mot marken'!W13)","v":0},{"$f":"IF('Mot marken'!X13<0,0,'Mot marken'!X13)","v":0},{"$f":"IF('Mot marken'!Y13<0,0,'Mot marken'!Y13)","v":0}]
["azimut",{"$f":"'Mot marken'!B14","v":-158.18146280680716},{"$f":"'Mot marken'!C14","v":-138.26713973182521},{"$f":"'Mot marken'!D14","v":-120.93718492399935},{"$f":"'Mot marken'!E14","v":-105.83541512018189},{"$f":"'Mot marken'!F14","v":-92.261433351179505},{"$f":"'Mot marken'!G14","v":-79.545126017601021},{"$f":"'Mot marken'!H14","v":-67.141773170231858},{"$f":"'Mot marken'!I14","v":-54.633617905499761},{"$f":"'Mot marken'!J14","v":-41.727697866177074},{"$f":"'Mot marken'!K14","v":-28.274565045280941},{"$f":"'Mot marken'!L14","v":-14.297993919623277},{"$f":"'Mot marken'!M14","v":0},{"$f":"'Mot marken'!N14","v":14.297993919623277},{"$f":"'Mot marken'!O14","v":28.274565045280941},{"$f":"'Mot marken'!P14","v":41.727697866177074},{"$f":"'Mot marken'!Q14","v":54.633617905499783},{"$f":"'Mot marken'!R14","v":67.141773170231872},{"$f":"'Mot marken'!S14","v":79.545126017600978},{"$f":"'Mot marken'!T14","v":92.261433351179662},{"$f":"'Mot marken'!U14","v":105.83541512018199},{"$f":"'Mot marken'!V14","v":120.93718492399935},{"$f":"'Mot marken'!W14","v":138.26713973182518},{"$f":"'Mot marken'!X14","v":158.18146280680719},{"$f":"'Mot marken'!Y14","v":180},"Summor","% av året"]
["Uppmätt IDN förd",{"$f":"'Mot marken'!B17","v":0},{"$f":"'Mot marken'!C17","v":0},{"$f":"'Mot marken'!D17","v":0},{"$f":"'Mot marken'!E17","v":0},{"$f":"'Mot marken'!F17","v":0},{"$f":"'Mot marken'!G17","v":0},{"$f":"'Mot marken'!H17","v":0},{"$f":"'Mot marken'!I17","v":0},{"$f":"'Mot marken'!J17","v":0.50169003226057285},{"$f":"'Mot marken'!K17","v":2.8701277965204266},{"$f":"'Mot marken'!L17","v":3.862545933842259},{"$f":"'Mot marken'!M17","v":4.1277624747534629},{"$f":"'Mot marken'!N17","v":3.862545933842259},{"$f":"'Mot marken'!O17","v":2.8701277965204346},{"$f":"'Mot marken'!P17","v":0.5016900322605865},{"$f":"'Mot marken'!Q17","v":0},{"$f":"'Mot marken'!R17","v":0},{"$f":"'Mot marken'!S17","v":0},{"$f":"'Mot marken'!T17","v":0},{"$f":"'Mot marken'!U17","v":0},{"$f":"'Mot marken'!V17","v":0},{"$f":"'Mot marken'!W17","v":0},{"$f":"'Mot marken'!X17","v":0},{"$f":"'Mot marken'!Y17","v":0},{"$f":"SUM(B21:Y21)","v":18.596490000000003}]
["Global IDH + IdH förd",{"$f":"'Mot marken'!B21","v":0},{"$f":"'Mot marken'!C21","v":0},{"$f":"'Mot marken'!D21","v":0},{"$f":"'Mot marken'!E21","v":0},{"$f":"'Mot marken'!F21","v":0},{"$f":"'Mot marken'!G21","v":0},{"$f":"'Mot marken'!H21","v":0},{"$f":"'Mot marken'!I21","v":0},{"$f":"'Mot marken'!J21","v":0.49215072047497971},{"$f":"'Mot marken'!K21","v":1.305632098056833},{"$f":"'Mot marken'!L21","v":1.817007870081389},{"$f":"'Mot marken'!M21","v":1.99142862277359},{"$f":"'Mot marken'!N21","v":1.817007870081389},{"$f":"'Mot marken'!O21","v":1.3056320980568363},{"$f":"'Mot marken'!P21","v":0.49215072047498443},{"$f":"'Mot marken'!Q21","v":0},{"$f":"'Mot marken'!R21","v":0},{"$f":"'Mot marken'!S21","v":0},{"$f":"'Mot marken'!T21","v":0},{"$f":"'Mot marken'!U21","v":0},{"$f":"'Mot marken'!V21","v":0},{"$f":"'Mot marken'!W21","v":0},{"$f":"'Mot marken'!X21","v":0},{"$f":"'Mot marken'!Y21","v":0},{"$f":"SUM(B22:Y22)","v":9.2210100000000015}]
["Diffusstrål IdH förd",{"$f":"'Mot marken'!B22","v":0},{"$f":"'Mot marken'!C22","v":0},{"$f":"'Mot marken'!D22","v":0},{"$f":"'Mot marken'!E22","v":0},{"$f":"'Mot marken'!F22","v":0},{"$f":"'Mot marken'!G22","v":0},{"$f":"'Mot marken'!H22","v":0},{"$f":"'Mot marken'!I22","v":0},{"$f":"'Mot marken'!J22","v":0.46903149483385026},{"$f":"'Mot marken'!K22","v":0.95474957341241073},{"$f":"'Mot marken'!L22","v":1.1598493368998284},{"$f":"'Mot marken'!M22","v":1.2217328000650673},{"$f":"'Mot marken'!N22","v":1.1598493368998284},{"$f":"'Mot marken'!O22","v":0.95474957341241207},{"$f":"'Mot marken'!P22","v":0.46903149483385415},{"$f":"'Mot marken'!Q22","v":0},{"$f":"'Mot marken'!R22","v":0},{"$f":"'Mot marken'!S22","v":0},{"$f":"'Mot marken'!T22","v":0},{"$f":"'Mot marken'!U22","v":0},{"$f":"'Mot marken'!V22","v":0},{"$f":"'Mot marken'!W22","v":0},{"$f":"'Mot marken'!X22","v":0},{"$f":"'Mot marken'!Y22","v":0},{"$f":"SUM(B23:Y23)","v":6.3889936103572511}]
["Direkt mot ytan",{"$f":"IF(B19<$L10,0,IF(AND(B20>$L8,B20<$M8,B19<$L9),0,IF(SIN(B19*PI()/180)*(COS($C$7*PI()/180))+COS(B19*PI()/180)*SIN($C$7*PI()/180)*(COS((B20-($C$8-180))*PI()/180))<0,0,B21*(SIN(B19*PI()/180)*(COS($C$7*PI()/180))+COS(B19*PI()/180)*SIN($C$7*PI()/180)*(COS((B20-($C$8-180))*PI()/180))))))","v":0},0,0,0,0,0,0,0,0,2.0220485673558026,{"$f":"IF(L19<$L$10,0,IF(AND(L20>$L8,L20<$M8,L19<$L9),0,IF(SIN(L19*PI()/180)*(COS($C$7*PI()/180))+COS(L19*PI()/180)*SIN($C$7*PI()/180)*(COS((L20-($C$8-180))*PI()/180))<0,0,L21*(SIN(L19*PI()/180)*(COS($C$7*PI()/180))+COS(L19*PI()/180)*SIN($C$7*PI()/180)*(COS((L20-($C$8-180))*PI()/180))))))","v":3.0727256950327835},{"$f":"IF(M19<$L10,0,IF(AND(M20>$L8,M20<$M8,M19<$L9),0,IF(SIN(M19*PI()/180)*(COS($C$7*PI()/180))+COS(M19*PI()/180)*SIN($C$7*PI()/180)*(COS((M20-($C$8-180))*PI()/180))<0,0,M21*(SIN(M19*PI()/180)*(COS($C$7*PI()/180))+COS(M19*PI()/180)*SIN($C$7*PI()/180)*(COS((M20-($C$8-180))*PI()/180))))))","v":3.4118337596415484},3.0727256950327835,2.0220485673558088,0,0,0,0,0,0,0,0,0,0,{"$f":"SUM(B24:Y24)","v":13.601382284418728}]
["Diffus mot ytan",{"$f":"(B23)*(2+(COS($C$7*PI()/180)))/3","v":0},{"$f":"(C23)*(2+(COS($C$7*PI()/180)))/3","v":0},0,0,0,0,0,0,0.42323944675159303,0.86153634817323343,1.0466120016920819,1.1024537159513907,1.0466120016920819,0.86153634817323477,0.42323944675159653,0,0,0,0,0,0,0,0,0,{"$f":"SUM(B25:Y25)","v":5.7652293091852123}]
["Markrefl. mot ytan",{"$f":"$F$8*B22*(1-COS($C$7*PI()/180))/2","v":0},{"$f":"$F$8*C22*(1-COS($C$7*PI()/180))/2","v":0},0,0,0,0,0,0,3.6036902165319122E-2,9.5602696946506735E-2,0.13304732091937835,0.14581898484034933,0.13304732091937835,9.5602696946506985E-2,3.6036902165319469E-2,0,0,0,0,0,0,0,0,0,0.67519282490275845]
["Summa mot ytan",{"$f":"SUM(B24:B26)","v":0},{"$f":"SUM(C24:C26)","v":0},0,0,0,0,0,0,0.45927634891691216,2.9791876124755428,4.2523850176442437,4.6601064604332878,4.2523850176442437,2.9791876124755508,0.45927634891691599,0,0,0,0,0,0,0,0,0,{"$f":"SUM(B27:Y27)","v":20.041804418506693},{"$f":"Z27/Z$162","v":1.6745659689003232E-2}]
[]
["Februari",{"$f":"'Mot marken'!B24","v":"deklination"},null,{"$f":"'Mot marken'!C24","v":-10.9}]
["Kl",{"$f":"'Mot marken'!B25","v":1},{"$f":"'Mot marken'!C25","v":2},{"$f":"'Mot marken'!D25","v":3},{"$f":"'Mot marken'!E25","v":4},{"$f":"'Mot marken'!F25","v":5},{"$f":"'Mot marken'!G25","v":6},{"$f":"'Mot marken'!H25","v":7},{"$f":"'Mot marken'!I25","v":8},{"$f":"'Mot marken'!J25","v":9},{"$f":"'Mot marken'!K25","v":10},{"$f":"'Mot marken'!L25","v":11},{"$f":"'Mot marken'!M25","v":12},{"$f":"'Mot marken'!N25","v":13},{"$f":"'Mot marken'!O25","v":14},{"$f":"'Mot marken'!P25","v":15},{"$f":"'Mot marken'!Q25","v":16},{"$f":"'Mot marken'!R25","v":17},{"$f":"'Mot marken'!S25","v":18},{"$f":"'Mot marken'!T25","v":19},{"$f":"'Mot marken'!U25","v":20},{"$f":"'Mot marken'!V25","v":21},{"$f":"'Mot marken'!W25","v":22},{"$f":"'Mot marken'!X25","v":23},{"$f":"'Mot marken'!Y25","v":24}]
["solhöjd",{"$f":"IF('Mot marken'!B26<0,0,'Mot marken'!B26)","v":0},{"$f":"IF('Mot marken'!C26<0,0,'Mot marken'!C26)","v":0},{"$f":"IF('Mot marken'!D26<0,0,'Mot marken'!D26)","v":0},{"$f":"IF('Mot marken'!E26<0,0,'Mot marken'!E26)","v":0},{"$f":"IF('Mot marken'!F26<0,0,'Mot marken'!F26)","v":0},{"$f":"IF('Mot marken'!G26<0,0,'Mot marken'!G26)","v":0},{"$f":"IF('Mot marken'!H26<0,0,'Mot marken'!H26)","v":0},{"$f":"IF('Mot marken'!I26<0,0,'Mot marken'!I26)","v":5.0249553163656548},{"$f":"IF('Mot marken'!J26<0,0,'Mot marken'!J26)","v":11.02610885897133},{"$f":"IF('Mot marken'!K26<0,0,'Mot marken'!K26)","v":15.712026703287284},{"$f":"IF('Mot marken'!L26<0,0,'Mot marken'!L26)","v":18.711757746754955},{"$f":"IF('Mot marken'!M26<0,0,'Mot marken'!M26)","v":19.746735000000008},{"$f":"IF('Mot marken'!N26<0,0,'Mot marken'!N26)","v":18.711757746754959},{"$f":"IF('Mot marken'!O26<0,0,'Mot marken'!O26)","v":15.712026703287302},{"$f":"IF('Mot marken'!P26<0,0,'Mot marken'!P26)","v":11.026108858971359},{"$f":"IF('Mot marken'!Q26<0,0,'Mot marken'!Q26)","v":5.0249553163656415},{"$f":"IF('Mot marken'!R26<0,0,'Mot marken'!R26)","v":0},{"$f":"IF('Mot marken'!S26<0,0,'Mot marken'!S26)","v":0},{"$f":"IF('Mot marken'!T26<0,0,'Mot marken'!T26)","v":0},{"$f":"IF('Mot marken'!U26<0,0,'Mot marken'!U26)","v":0},{"$f":"IF('Mot marken'!V26<0,0,'Mot marken'!V26)","v":0},{"$f":"IF('Mot marken'!W26<0,0,'Mot marken'!W26)","v":0},{"$f":"IF('Mot marken'!X26<0,0,'Mot marken'!X26)","v":0},{"$f":"IF('Mot marken'!Y26<0,0,'Mot marken'!Y26)","v":0}]
["azimut",{"$f":"'Mot marken'!B27","v":-160.548430791253},{"$f":"'Mot marken'!C27","v":-142.29910554099791},{"$f":"'Mot marken'!D27","v":-125.81066607608309},{"$f":"'Mot marken'!E27","v":-110.97497954380407},{"$f":"'Mot marken'!F27","v":-97.344922965887164},{"$f":"'Mot marken'!G27","v":-84.39374408726556},{"$f":"'Mot marken'!H27","v":-71.626214570464498},{"$f":"'Mot marken'!I27","v":-58.614453032217043},{"$f":"'Mot marken'!J27","v":-45.024439130939548},{"$f":"'Mot marken'!K27","v":-30.666289292353802},{"$f":"'Mot marken'!L27","v":-15.565063342381514},{"$f":"'Mot marken'!M27","v":0},{"$f":"'Mot marken'!N27","v":15.565063342381514},{"$f":"'Mot marken'!O27","v":30.666289292353802},{"$f":"'Mot marken'!P27","v":45.024439130939548},{"$f":"'Mot marken'!Q27","v":58.614453032217043},{"$f":"'Mot marken'!R27","v":71.626214570464498},{"$f":"'Mot marken'!S27","v":84.39374408726556},{"$f":"'Mot marken'!T27","v":97.344922965887207},{"$f":"'Mot marken'!U27","v":110.9749795438041},{"$f":"'Mot marken'!V27","v":125.81066607608311},{"$f":"'Mot marken'!W27","v":142.29910554099791},{"$f":"'Mot marken'!X27","v":160.548430791253},{"$f":"'Mot marken'!Y27","v":180},{"$f":"Luleå!Z162","v":"Summa"}]
["Uppmätt IDN förd",{"$f":"'Mot marken'!B30","v":0},{"$f":"'Mot marken'!C30","v":0},{"$f":"'Mot marken'!D30","v":0},{"$f":"'Mot marken'!E30","v":0},{"$f":"'Mot marken'!F30","v":0},{"$f":"'Mot marken'!G30","v":0},{"$f":"'Mot marken'!H30","v":0},{"$f":"'Mot marken'!I30","v":1.4480481499989193},{"$f":"'Mot marken'!J30","v":3.217182625492415},{"$f":"'Mot marken'!K30","v":3.9221177146829129},{"$f":"'Mot marken'!L30","v":4.2244250458147317},{"$f":"'Mot marken'!M30","v":4.311052928022046},{"$f":"'Mot marken'!N30","v":4.2244250458147317},{"$f":"'Mot marken'!O30","v":3.9221177146829156},{"$f":"'Mot marken'!P30","v":3.2171826254924207},{"$f":"'Mot marken'!Q30","v":1.4480481499989135},{"$f":"'Mot marken'!R30","v":0},{"$f":"'Mot marken'!S30","v":0},{"$f":"'Mot marken'!T30","v":0},{"$f":"'Mot marken'!U30","v":0},{"$f":"'Mot marken'!V30","v":0},{"$f":"'Mot marken'!W30","v":0},{"$f":"'Mot marken'!X30","v":0},{"$f":"'Mot marken'!Y30","v":0},{"$f":"SUM(B33:Y33)","v":29.934600000000003}]
["Global IDH + IdH förd",{"$f":"'Mot marken'!B34","v":0},{"$f":"'Mot marken'!C34","v":0},{"$f":"'Mot marken'!D34","v":0},{"$f":"'Mot marken'!E34","v":0},{"$f":"'Mot marken'!F34","v":0},{"$f":"'Mot marken'!G34","v":0},{"$f":"'Mot marken'!H34","v":0},{"$f":"'Mot marken'!I34","v":0.92535222598476008},{"$f":"'Mot marken'!J34","v":2.0205523606602083},{"$f":"'Mot marken'!K34","v":2.8609289812348733},{"$f":"'Mot marken'!L34","v":3.3892118098046202},{"$f":"'Mot marken'!M34","v":3.5693992446310712},{"$f":"'Mot marken'!N34","v":3.3892118098046202},{"$f":"'Mot marken'!O34","v":2.8609289812348759},{"$f":"'Mot marken'!P34","v":2.0205523606602136},{"$f":"'Mot marken'!Q34","v":0.92535222598475764},{"$f":"'Mot marken'!R34","v":0},{"$f":"'Mot marken'!S34","v":0},{"$f":"'Mot marken'!T34","v":0},{"$f":"'Mot marken'!U34","v":0},{"$f":"'Mot marken'!V34","v":0},{"$f":"'Mot marken'!W34","v":0},{"$f":"'Mot marken'!X34","v":0},{"$f":"'Mot marken'!Y34","v":0},{"$f":"SUM(B34:Y34)","v":21.961490000000005}]
["Diffusstrål IdH",{"$f":"'Mot marken'!B35","v":0},{"$f":"'Mot marken'!C35","v":0},{"$f":"'Mot marken'!D35","v":0},{"$f":"'Mot marken'!E35","v":0},{"$f":"'Mot marken'!F35","v":0},{"$f":"'Mot marken'!G35","v":0},{"$f":"'Mot marken'!H35","v":0},{"$f":"'Mot marken'!I35","v":0.79851822503558068},{"$f":"'Mot marken'!J35","v":1.4052459510712079},{"$f":"'Mot marken'!K35","v":1.7988096424307707},{"$f":"'Mot marken'!L35","v":2.033985154152675},{"$f":"'Mot marken'!M35","v":2.1128536047569444},{"$f":"'Mot marken'!N35","v":2.033985154152675},{"$f":"'Mot marken'!O35","v":1.7988096424307713},{"$f":"'Mot marken'!P35","v":1.4052459510712105},{"$f":"'Mot marken'!Q35","v":0.79851822503557912},{"$f":"'Mot marken'!R35","v":0},{"$f":"'Mot marken'!S35","v":0},{"$f":"'Mot marken'!T35","v":0},{"$f":"'Mot marken'!U35","v":0},{"$f":"'Mot marken'!V35","v":0},{"$f":"'Mot marken'!W35","v":0},{"$f":"'Mot marken'!X35","v":0},{"$f":"'Mot marken'!Y35","v":0},14.185971550137415]
["Direkt mot ytan",{"$f":"IF(B31<$L$10,0,IF(AND(B32>$L8,B32<$M8,B31<$L9),0,IF(SIN(B31*PI()/180)*(COS($C$7*PI()/180))+COS(B31*PI()/180)*SIN($C$7*PI()/180)*(COS((B32-($C$8-180))*PI()/180))<0,0,B33*(SIN(B31*PI()/180)*(COS($C$7*PI()/180))+COS(B31*PI()/180)*SIN($C$7*PI()/180)*(COS((B32-($C$8-180))*PI()/180))))))","v":0},0,0,0,0,0,0,0.62088983047824164,2.013310653669707,3.0474062029621134,{"$f":"IF(L31<$L$10,0,IF(AND(L32>$L8,L32<$M8,L31<$L9),0,IF(SIN(L31*PI()/180)*(COS($C$7*PI()/180))+COS(L31*PI()/180)*SIN($C$7*PI()/180)*(COS((L32-($C$8-180))*PI()/180))<0,0,L33*(SIN(L31*PI()/180)*(COS($C$7*PI()/180))+COS(L31*PI()/180)*SIN($C$7*PI()/180)*(COS((L32-($C$8-180))*PI()/180))))))","v":3.6837654588746362},{"$f":"IF(M31<$L$10,0,IF(AND(M32>$L8,M32<$M8,M31<$L9),0,IF(SIN(M31*PI()/180)*(COS($C$7*PI()/180))+COS(M31*PI()/180)*SIN($C$7*PI()/180)*(COS((M32-($C$8-180))*PI()/180))<0,0,M33*(SIN(M31*PI()/180)*(COS($C$7*PI()/180))+COS(M31*PI()/180)*SIN($C$7*PI()/180)*(COS((M32-($C$8-180))*PI()/180))))))","v":3.8990492035854727},3.6837654588746362,3.047406202962117,2.0133106536697114,0.62088983047823909,0,0,0,0,0,0,0,0,{"$f":"SUM(B36:Y36)","v":22.629793495554878}]
["Diffus mot ytan",{"$f":"(B35)*(2+(COS($C$7*PI()/180)))/3","v":0},{"$f":"(C35)*(2+(COS($C$7*PI()/180)))/3","v":0},0,0,0,0,0,0.72055803396495532,1.2680502811266019,1.6231899270293626,1.8354050012131573,1.9065734403639885,1.8354050012131573,1.6231899270293633,1.2680502811266046,0.72055803396495388,0,0,0,0,0,0,0,0,{"$f":"SUM(B37:Y37)","v":12.800979927032145}]
["Markrefl. mot ytan",{"$f":"$F$8*B34*(1-COS($C$7*PI()/180))/2","v":0},{"$f":"$F$8*C34*(1-COS($C$7*PI()/180))/2","v":0},0,0,0,0,0,6.775734800121741E-2,0.14795152117372207,0.20948667452764333,0.24816928905356045,0.26136320849757505,0.24816928905356045,0.20948667452764352,0.14795152117372246,6.775734800121723E-2,0,0,0,0,0,0,0,0,1.6080928740098621]
["Summa mot ytan",{"$f":"SUM(B36:B38)","v":0},{"$f":"SUM(C36:C38)","v":0},0,0,0,0,0,1.4092052124444145,3.429312455970031,4.8800828045191196,5.7673397491413541,6.0669858524470364,5.7673397491413541,4.880082804519124,3.4293124559700385,1.4092052124444103,0,0,0,0,0,0,0,0,{"$f":"SUM(B39:Y39)","v":37.038866296596886},{"$f":"Z39/Z$162","v":3.0947325765566813E-2}]
[]
["Mars",{"$f":"'Mot marken'!B37","v":"deklination"},null,{"$f":"'Mot marken'!C37","v":0}]
["Kl",{"$f":"'Mot marken'!B38","v":1},{"$f":"'Mot marken'!C38","v":2},{"$f":"'Mot marken'!D38","v":3},{"$f":"'Mot marken'!E38","v":4},{"$f":"'Mot marken'!F38","v":5},{"$f":"'Mot marken'!G38","v":6},{"$f":"'Mot marken'!H38","v":7},{"$f":"'Mot marken'!I38","v":8},{"$f":"'Mot marken'!J38","v":9},{"$f":"'Mot marken'!K38","v":10},{"$f":"'Mot marken'!L38","v":11},{"$f":"'Mot marken'!M38","v":12},{"$f":"'Mot marken'!N38","v":13},{"$f":"'Mot marken'!O38","v":14},{"$f":"'Mot marken'!P38","v":15},{"$f":"'Mot marken'!Q38","v":16},{"$f":"'Mot marken'!R38","v":17},{"$f":"'Mot marken'!S38","v":18},{"$f":"'Mot marken'!T38","v":19},{"$f":"'Mot marken'!U38","v":20},{"$f":"'Mot marken'!V38","v":21},{"$f":"'Mot marken'!W38","v":22},{"$f":"'Mot marken'!X38","v":23},{"$f":"'Mot marken'!Y38","v":24}]
["solhöjd",{"$f":"IF('Mot marken'!B39<0,0,'Mot marken'!B39)","v":0},{"$f":"IF('Mot marken'!C39<0,0,'Mot marken'!C39)","v":0},{"$f":"IF('Mot marken'!D39<0,0,'Mot marken'!D39)","v":0},{"$f":"IF('Mot marken'!E39<0,0,'Mot marken'!E39)","v":0},{"$f":"IF('Mot marken'!F39<0,0,'Mot marken'!F39)","v":0},{"$f":"IF('Mot marken'!G39<0,0,'Mot marken'!G39)","v":0},{"$f":"IF('Mot marken'!H39<0,0,'Mot marken'!H39)","v":7.5812080846530563},{"$f":"IF('Mot marken'!I39<0,0,'Mot marken'!I39)","v":14.765981014739737},{"$f":"IF('Mot marken'!J39<0,0,'Mot marken'!J39)","v":21.12740278981671},{"$f":"IF('Mot marken'!K39<0,0,'Mot marken'!K39)","v":26.196476812473009},{"$f":"IF('Mot marken'!L39<0,0,'Mot marken'!L39)","v":29.496754156026245},{"$f":"IF('Mot marken'!M39<0,0,'Mot marken'!M39)","v":30.64673500000001},{"$f":"IF('Mot marken'!N39<0,0,'Mot marken'!N39)","v":29.496754156026245},{"$f":"IF('Mot marken'!O39<0,0,'Mot marken'!O39)","v":26.196476812473026},{"$f":"IF('Mot marken'!P39<0,0,'Mot marken'!P39)","v":21.127402789816745},{"$f":"IF('Mot marken'!Q39<0,0,'Mot marken'!Q39)","v":14.765981014739721},{"$f":"IF('Mot marken'!R39<0,0,'Mot marken'!R39)","v":7.5812080846530465},{"$f":"IF('Mot marken'!S39<0,0,'Mot marken'!S39)","v":8.9454648724253859E-15},{"$f":"IF('Mot marken'!T39<0,0,'Mot marken'!T39)","v":0},{"$f":"IF('Mot marken'!U39<0,0,'Mot marken'!U39)","v":0},{"$f":"IF('Mot marken'!V39<0,0,'Mot marken'!V39)","v":0},{"$f":"IF('Mot marken'!W39<0,0,'Mot marken'!W39)","v":0},{"$f":"IF('Mot marken'!X39<0,0,'Mot marken'!X39)","v":0},{"$f":"IF('Mot marken'!Y39<0,0,'Mot marken'!Y39)","v":0}]
["azimut",{"$f":"'Mot marken'!B40","v":-162.70076983452199},{"$f":"'Mot marken'!C40","v":-146.13512059411954},{"$f":"'Mot marken'!D40","v":-130.70628382281495},{"$f":"'Mot marken'!E40","v":-116.41403889135285},{"$f":"'Mot marken'!F40","v":-102.98126481840468},{"$f":"'Mot marken'!G40","v":-90},{"$f":"'Mot marken'!H40","v":-77.018735181595318},{"$f":"'Mot marken'!I40","v":-63.585961108647133},{"$f":"'Mot marken'!J40","v":-49.293716177185026},{"$f":"'Mot marken'!K40","v":-33.864879405880451},{"$f":"'Mot marken'!L40","v":-17.299230165478001},{"$f":"'Mot marken'!M40","v":0},{"$f":"'Mot marken'!N40","v":17.299230165478001},{"$f":"'Mot marken'!O40","v":33.864879405880451},{"$f":"'Mot marken'!P40","v":49.293716177185033},{"$f":"'Mot marken'!Q40","v":63.585961108647126},{"$f":"'Mot marken'!R40","v":77.018735181595318},{"$f":"'Mot marken'!S40","v":90},{"$f":"'Mot marken'!T40","v":102.98126481840468},{"$f":"'Mot marken'!U40","v":116.41403889135287},{"$f":"'Mot marken'!V40","v":130.70628382281495},{"$f":"'Mot marken'!W40","v":146.13512059411954},{"$f":"'Mot marken'!X40","v":162.70076983452199},{"$f":"'Mot marken'!Y40","v":180},"Summa"]
["Uppmätt IDN förd",{"$f":"'Mot marken'!B43","v":0},{"$f":"'Mot marken'!C43","v":0},{"$f":"'Mot marken'!D43","v":0},{"$f":"'Mot marken'!E43","v":0},{"$f":"'Mot marken'!F43","v":0},{"$f":"'Mot marken'!G43","v":0},{"$f":"'Mot marken'!H43","v":4.9251424209949235},{"$f":"'Mot marken'!I43","v":7.8931702473394809},{"$f":"'Mot marken'!J43","v":9.1544671779451523},{"$f":"'Mot marken'!K43","v":9.7758646526887087},{"$f":"'Mot marken'!L43","v":10.075826154925362},{"$f":"'Mot marken'!M43","v":10.166178692212741},{"$f":"'Mot marken'!N43","v":10.075826154925362},{"$f":"'Mot marken'!O43","v":9.7758646526887123},{"$f":"'Mot marken'!P43","v":9.1544671779451576},{"$f":"'Mot marken'!Q43","v":7.8931702473394774},{"$f":"'Mot marken'!R43","v":4.9251424209949164},{"$f":"'Mot marken'!S43","v":0},{"$f":"'Mot marken'!T43","v":0},{"$f":"'Mot marken'!U43","v":0},{"$f":"'Mot marken'!V43","v":0},{"$f":"'Mot marken'!W43","v":0},{"$f":"'Mot marken'!X43","v":0},{"$f":"'Mot marken'!Y43","v":0},{"$f":"SUM(B45:Y45)","v":93.815119999999993}]
["Global IDH + IdH förd",{"$f":"'Mot marken'!B47","v":0},{"$f":"'Mot marken'!C47","v":0},{"$f":"'Mot marken'!D47","v":0},{"$f":"'Mot marken'!E47","v":0},{"$f":"'Mot marken'!F47","v":0},{"$f":"'Mot marken'!G47","v":0},{"$f":"'Mot marken'!H47","v":2.3184507349758841},{"$f":"'Mot marken'!I47","v":4.4789028837841514},{"$f":"'Mot marken'!J47","v":6.3341252027995099},{"$f":"'Mot marken'!K47","v":7.7576873568809086},{"$f":"'Mot marken'!L47","v":8.6525759377753939},{"$f":"'Mot marken'!M47","v":8.9578057675683009},{"$f":"'Mot marken'!N47","v":8.6525759377753939},{"$f":"'Mot marken'!O47","v":7.7576873568809139},{"$f":"'Mot marken'!P47","v":6.3341252027995196},{"$f":"'Mot marken'!Q47","v":4.4789028837841469},{"$f":"'Mot marken'!R47","v":2.3184507349758805},{"$f":"'Mot marken'!S47","v":2.7436604738769571E-15},{"$f":"'Mot marken'!T47","v":0},{"$f":"'Mot marken'!U47","v":0},{"$f":"'Mot marken'!V47","v":0},{"$f":"'Mot marken'!W47","v":0},{"$f":"'Mot marken'!X47","v":0},{"$f":"'Mot marken'!Y47","v":0},{"$f":"SUM(B46:Y46)","v":68.041290000000018},null,null,null,{"$f":"IF(AND(K68>$L8,K68<$M8,K67<$L9),0,\"s\")","v":"s"}]
["Diffusstrål IdH",{"$f":"'Mot marken'!B48","v":0},{"$f":"'Mot marken'!C48","v":0},{"$f":"'Mot marken'!D48","v":0},{"$f":"'Mot marken'!E48","v":0},{"$f":"'Mot marken'!F48","v":0},{"$f":"'Mot marken'!G48","v":0},{"$f":"'Mot marken'!H48","v":1.6686703740129016},{"$f":"'Mot marken'!I48","v":2.4671574167761467},{"$f":"'Mot marken'!J48","v":3.0344618681031728},{"$f":"'Mot marken'!K48","v":3.4421252735843808},{"$f":"'Mot marken'!L48","v":3.691498560530392},{"$f":"'Mot marken'!M48","v":3.7756639259563238},{"$f":"'Mot marken'!N48","v":3.691498560530392},{"$f":"'Mot marken'!O48","v":3.4421252735843817},{"$f":"'Mot marken'!P48","v":3.034461868103175},{"$f":"'Mot marken'!Q48","v":2.4671574167761454},{"$f":"'Mot marken'!R48","v":1.6686703740129001},{"$f":"'Mot marken'!S48","v":2.7436604738769571E-15},{"$f":"'Mot marken'!T48","v":0},{"$f":"'Mot marken'!U48","v":0},{"$f":"'Mot marken'!V48","v":0},{"$f":"'Mot marken'!W48","v":0},{"$f":"'Mot marken'!X48","v":0},{"$f":"'Mot marken'!Y48","v":0},32.383490911970313]
["Direkt mot ytan",{"$f":"IF(B43<$L$10,0,IF(AND(B44>$L8,B44<$M8,B43<$L9),0,IF(SIN(B43*PI()/180)*(COS($C$7*PI()/180))+COS(B43*PI()/180)*SIN($C$7*PI()/180)*(COS((B44-($C$8-180))*PI()/180))<0,0,B45*(SIN(B43*PI()/180)*(COS($C$7*PI()/180))+COS(B43*PI()/180)*SIN($C$7*PI()/180)*(COS((B44-($C$8-180))*PI()/180))))))","v":0},0,0,0,0,0,1.2349311328115755,3.8233951928292935,6.271129791879809,8.2018821934627315,{"$f":"IF(L43<$L$10,0,IF(AND(L44>$L8,L44<$M8,L43<$L9),0,IF(SIN(L43*PI()/180)*(COS($C$7*PI()/180))+COS(L43*PI()/180)*SIN($C$7*PI()/180)*(COS((L44-($C$8-180))*PI()/180))<0,0,L45*(SIN(L43*PI()/180)*(COS($C$7*PI()/180))+COS(L43*PI()/180)*SIN($C$7*PI()/180)*(COS((L44-($C$8-180))*PI()/180))))))","v":9.4287074117896985},{"$f":"IF(M43<$L$10,0,IF(AND(M44>$L8,M44<$M8,M43<$L9),0,IF(SIN(M43*PI()/180)*(COS($C$7*PI()/180))+COS(M43*PI()/180)*SIN($C$7*PI()/180)*(COS((M44-($C$8-180))*PI()/180))<0,0,M45*(SIN(M43*PI()/180)*(COS($C$7*PI()/180))+COS(M43*PI()/180)*SIN($C$7*PI()/180)*(COS((M44-($C$8-180))*PI()/180))))))","v":9.8488484406759902},9.4287074117896985,8.2018821934627368,6.2711297918798143,3.8233951928292913,1.2349311328115733,0,0,0,0,0,0,0,{"$f":"SUM(B48:Y48)","v":67.768939886222213}]
["Diffus mot ytan",{"$f":"(B47)*(2+(COS($C$7*PI()/180)))/3","v":0},{"$f":"(C47)*(2+(COS($C$7*PI()/180)))/3","v":0},0,0,0,0,1.5057562950184729,2.2262861910697973,2.7382041001313659,3.1060668899379587,3.3310935953174012,3.4070418058125953,3.3310935953174012,3.10606688993796,2.7382041001313677,2.226286191069796,1.5057562950184715,2.475793958035269E-15,0,0,0,0,0,0,{"$f":"SUM(B49:Y49)","v":29.221855948762592}]
["Markrefl. mot ytan",{"$f":"$F$8*B46*(1-COS($C$7*PI()/180))/2","v":0},{"$f":"$F$8*C46*(1-COS($C$7*PI()/180))/2","v":0},0,0,0,0,0.1697646246068753,0.32796007059609861,0.46380557975384012,0.56804350512631829,0.63357020436071543,0.6559201411921971,0.63357020436071543,0.56804350512631874,0.46380557975384085,0.32796007059609833,0.16976462460687505,2.0089988688126604E-16,0,0,0,0,0,0,4.9822081100798936]
["Summa mot ytan",{"$f":"SUM(B48:B50)","v":0},{"$f":"SUM(C48:C50)","v":0},0,0,0,0,2.9104520524369235,6.3776414544951896,9.4731394717650144,11.875992588527009,13.393371211467816,13.911810387680783,13.393371211467816,11.875992588527016,9.4731394717650215,6.3776414544951852,2.9104520524369195,2.6766938449165352E-15,0,0,0,0,0,0,{"$f":"SUM(B51:Y51)","v":101.9730039450647},8.520216971844248E-2]
[]
["April",{"$f":"'Mot marken'!B50","v":"deklination"},null,{"$f":"'Mot marken'!C50","v":10.9}]
["Kl",{"$f":"'Mot marken'!B51","v":1},{"$f":"'Mot marken'!C51","v":2},{"$f":"'Mot marken'!D51","v":3},{"$f":"'Mot marken'!E51","v":4},{"$f":"'Mot marken'!F51","v":5},{"$f":"'Mot marken'!G51","v":6},{"$f":"'Mot marken'!H51","v":7},{"$f":"'Mot marken'!I51","v":8},{"$f":"'Mot marken'!J51","v":9},{"$f":"'Mot marken'!K51","v":10},{"$f":"'Mot marken'!L51","v":11},{"$f":"'Mot marken'!M51","v":12},{"$f":"'Mot marken'!N51","v":13},{"$f":"'Mot marken'!O51","v":14},{"$f":"'Mot marken'!P51","v":15},{"$f":"'Mot marken'!Q51","v":16},{"$f":"'Mot marken'!R51","v":17},{"$f":"'Mot marken'!S51","v":18},{"$f":"'Mot marken'!T51","v":19},{"$f":"'Mot marken'!U51","v":20},{"$f":"'Mot marken'!V51","v":21},{"$f":"'Mot marken'!W51","v":22},{"$f":"'Mot marken'!X51","v":23},{"$f":"'Mot marken'!Y51","v":24}]
["solhöjd",{"$f":"IF('Mot marken'!B52<0,0,'Mot marken'!B52)","v":0},{"$f":"IF('Mot marken'!C52<0,0,'Mot marken'!C52)","v":0},{"$f":"IF('Mot marken'!D52<0,0,'Mot marken'!D52)","v":0},{"$f":"IF('Mot marken'!E52<0,0,'Mot marken'!E52)","v":0},{"$f":"IF('Mot marken'!F52<0,0,'Mot marken'!F52)","v":1.898714370648481},{"$f":"IF('Mot marken'!G52<0,0,'Mot marken'!G52)","v":9.362709526604819},{"$f":"IF('Mot marken'!H52<0,0,'Mot marken'!H52)","v":16.99180362973674},{"$f":"IF('Mot marken'!I52<0,0,'Mot marken'!I52)","v":24.390742426483413},{"$f":"IF('Mot marken'!J52<0,0,'Mot marken'!J52)","v":31.106063294891477},{"$f":"IF('Mot marken'!K52<0,0,'Mot marken'!K52)","v":36.596095571113672},{"$f":"IF('Mot marken'!L52<0,0,'Mot marken'!L52)","v":40.253831197620123},{"$f":"IF('Mot marken'!M52<0,0,'Mot marken'!M52)","v":41.54673500000002},{"$f":"IF('Mot marken'!N52<0,0,'Mot marken'!N52)","v":40.25383119762013},{"$f":"IF('Mot marken'!O52<0,0,'Mot marken'!O52)","v":36.596095571113686},{"$f":"IF('Mot marken'!P52<0,0,'Mot marken'!P52)","v":31.106063294891509},{"$f":"IF('Mot marken'!Q52<0,0,'Mot marken'!Q52)","v":24.390742426483396},{"$f":"IF('Mot marken'!R52<0,0,'Mot marken'!R52)","v":16.991803629736726},{"$f":"IF('Mot marken'!S52<0,0,'Mot marken'!S52)","v":9.3627095266048332},{"$f":"IF('Mot marken'!T52<0,0,'Mot marken'!T52)","v":1.8987143706484935},{"$f":"IF('Mot marken'!U52<0,0,'Mot marken'!U52)","v":0},{"$f":"IF('Mot marken'!V52<0,0,'Mot marken'!V52)","v":0},{"$f":"IF('Mot marken'!W52<0,0,'Mot marken'!W52)","v":0},{"$f":"IF('Mot marken'!X52<0,0,'Mot marken'!X52)","v":0},{"$f":"IF('Mot marken'!Y52<0,0,'Mot marken'!Y52)","v":0}]
["azimut",{"$f":"'Mot marken'!B53","v":-164.43493665761847},{"$f":"'Mot marken'!C53","v":-149.33371070764619},{"$f":"'Mot marken'!D53","v":-134.97556086906044},{"$f":"'Mot marken'!E53","v":-121.38554696778294},{"$f":"'Mot marken'!F53","v":-108.3737854295355},{"$f":"'Mot marken'!G53","v":-95.60625591273444},{"$f":"'Mot marken'!H53","v":-82.655077034112836},{"$f":"'Mot marken'!I53","v":-69.025020456195904},{"$f":"'Mot marken'!J53","v":-54.189333923916855},{"$f":"'Mot marken'!K53","v":-37.7008944590021},{"$f":"'Mot marken'!L53","v":-19.451569208746974},{"$f":"'Mot marken'!M53","v":0},{"$f":"'Mot marken'!N53","v":19.451569208746978},{"$f":"'Mot marken'!O53","v":37.7008944590021},{"$f":"'Mot marken'!P53","v":54.189333923916898},{"$f":"'Mot marken'!Q53","v":69.025020456195904},{"$f":"'Mot marken'!R53","v":82.655077034112836},{"$f":"'Mot marken'!S53","v":95.606255912734383},{"$f":"'Mot marken'!T53","v":108.3737854295355},{"$f":"'Mot marken'!U53","v":121.38554696778294},{"$f":"'Mot marken'!V53","v":134.97556086906044},{"$f":"'Mot marken'!W53","v":149.33371070764619},{"$f":"'Mot marken'!X53","v":164.43493665761847},{"$f":"'Mot marken'!Y53","v":180},"Summa"]
["Uppmätt IDN förd",{"$f":"'Mot marken'!B56","v":0},{"$f":"'Mot marken'!C56","v":0},{"$f":"'Mot marken'!D56","v":0},{"$f":"'Mot marken'!E56","v":0},{"$f":"'Mot marken'!F56","v":0.29422103721905613},{"$f":"'Mot marken'!G56","v":6.5342353587046791},{"$f":"'Mot marken'!H56","v":9.2866581073764749},{"$f":"'Mot marken'!I56","v":10.565811896487869},{"$f":"'Mot marken'!J56","v":11.249305655676364},{"$f":"'Mot marken'!K56","v":11.630410962951951},{"$f":"'Mot marken'!L56","v":11.826800187405686},{"$f":"'Mot marken'!M56","v":11.887673588355829},{"$f":"'Mot marken'!N56","v":11.826800187405686},{"$f":"'Mot marken'!O56","v":11.630410962951951},{"$f":"'Mot marken'!P56","v":11.24930565567637},{"$f":"'Mot marken'!Q56","v":10.565811896487867},{"$f":"'Mot marken'!R56","v":9.2866581073764713},{"$f":"'Mot marken'!S56","v":6.5342353587046853},{"$f":"'Mot marken'!T56","v":0.29422103721906351},{"$f":"'Mot marken'!U56","v":0},{"$f":"'Mot marken'!V56","v":0},{"$f":"'Mot marken'!W56","v":0},{"$f":"'Mot marken'!X56","v":0},{"$f":"'Mot marken'!Y56","v":0},{"$f":"SUM(B57:Y57)","v":134.66256000000001}]
["Global IDH + IdH förd",{"$f":"'Mot marken'!B60","v":0},{"$f":"'Mot marken'!C60","v":0},{"$f":"'Mot marken'!D60","v":0},{"$f":"'Mot marken'!E60","v":0},{"$f":"'Mot marken'!F60","v":0.65335031058439386},{"$f":"'Mot marken'!G60","v":3.207989699846447},{"$f":"'Mot marken'!H60","v":5.7626290891085068},{"$f":"'Mot marken'!I60","v":8.1431740257335541},{"$f":"'Mot marken'!J60","v":10.187394306327109},{"$f":"'Mot marken'!K60","v":11.755979697000472},{"$f":"'Mot marken'!L60","v":12.742033695589164},{"$f":"'Mot marken'!M60","v":13.078358351620656},{"$f":"'Mot marken'!N60","v":12.742033695589166},{"$f":"'Mot marken'!O60","v":11.755979697000475},{"$f":"'Mot marken'!P60","v":10.187394306327118},{"$f":"'Mot marken'!Q60","v":8.143174025733547},{"$f":"'Mot marken'!R60","v":5.7626290891085032},{"$f":"'Mot marken'!S60","v":3.207989699846451},{"$f":"'Mot marken'!T60","v":0.65335031058439808},{"$f":"'Mot marken'!U60","v":0},{"$f":"'Mot marken'!V60","v":0},{"$f":"'Mot marken'!W60","v":0},{"$f":"'Mot marken'!X60","v":0},{"$f":"'Mot marken'!Y60","v":0},117.98345999999995]
["Diffusstrål IdH",{"$f":"'Mot marken'!B61","v":0},{"$f":"'Mot marken'!C61","v":0},{"$f":"'Mot marken'!D61","v":0},{"$f":"'Mot marken'!E61","v":0},{"$f":"'Mot marken'!F61","v":0.64360195785108032},{"$f":"'Mot marken'!G61","v":2.1449752946509149},{"$f":"'Mot marken'!H61","v":3.0487434964647742},{"$f":"'Mot marken'!I61","v":3.7799450776911661},{"$f":"'Mot marken'!J61","v":4.375733696502901},{"$f":"'Mot marken'!K61","v":4.822275668704525},{"$f":"'Mot marken'!L61","v":5.0998509275062816},{"$f":"'Mot marken'!M61","v":5.1940878525839267},{"$f":"'Mot marken'!N61","v":5.0998509275062824},{"$f":"'Mot marken'!O61","v":4.8222756687045267},{"$f":"'Mot marken'!P61","v":4.3757336965029019},{"$f":"'Mot marken'!Q61","v":3.7799450776911634},{"$f":"'Mot marken'!R61","v":3.0487434964647737},{"$f":"'Mot marken'!S61","v":2.1449752946509162},{"$f":"'Mot marken'!T61","v":0.64360195785108421},{"$f":"'Mot marken'!U61","v":0},{"$f":"'Mot marken'!V61","v":0},{"$f":"'Mot marken'!W61","v":0},{"$f":"'Mot marken'!X61","v":0},{"$f":"'Mot marken'!Y61","v":0},{"$f":"SUM(B59:Y59)","v":53.024340091327218}]
["Direkt mot ytan",{"$f":"IF(B55<$L$10,0,IF(AND(B56>$L8,B56<$M8,B55<$L9),0,IF(SIN(B55*PI()/180)*(COS($C$7*PI()/180))+COS(B55*PI()/180)*SIN($C$7*PI()/180)*(COS((B56-($C$8-180))*PI()/180))<0,0,B57*(SIN(B55*PI()/180)*(COS($C$7*PI()/180))+COS(B55*PI()/180)*SIN($C$7*PI()/180)*(COS((B56-($C$8-180))*PI()/180))))))","v":0},0,0,0,0,0.30630347706748579,2.721856571451251,5.5209588445235829,8.0944686205180396,10.126985160248433,{"$f":"IF(L55<$L$10,0,IF(AND(L56>$L8,L56<$M8,L55<$L9),0,IF(SIN(L55*PI()/180)*(COS($C$7*PI()/180))+COS(L55*PI()/180)*SIN($C$7*PI()/180)*(COS((L56-($C$8-180))*PI()/180))<0,0,L57*(SIN(L55*PI()/180)*(COS($C$7*PI()/180))+COS(L55*PI()/180)*SIN($C$7*PI()/180)*(COS((L56-($C$8-180))*PI()/180))))))","v":11.421959872812186},{"$f":"IF(M55<$L$10,0,IF(AND(M56>$L8,M56<$M8,M55<$L9),0,IF(SIN(M55*PI()/180)*(COS($C$7*PI()/180))+COS(M55*PI()/180)*SIN($C$7*PI()/180)*(COS((M56-($C$8-180))*PI()/180))<0,0,M57*(SIN(M55*PI()/180)*(COS($C$7*PI()/180))+COS(M55*PI()/180)*SIN($C$7*PI()/180)*(COS((M56-($C$8-180))*PI()/180))))))","v":11.866088692684087},11.421959872812188,10.126985160248434,8.0944686205180414,5.5209588445235811,2.7218565714512479,0.30630347706749117,0,0,0,0,0,0,{"$f":"SUM(B60:Y60)","v":88.251153785926036}]
["Diffus mot ytan",{"$f":"(B59)*(2+(COS($C$7*PI()/180)))/3","v":0},{"$f":"(C59)*(2+(COS($C$7*PI()/180)))/3","v":0},0,0,0.58076640816119929,1.9355590552090349,2.7510913977927252,3.4109049841101555,3.9485261208231606,4.3514717211669707,4.6019470096309201,4.6869834826028738,4.6019470096309201,4.3514717211669725,3.948526120823161,3.4109049841101533,2.7510913977927243,1.935559055209036,0.58076640816120284,0,0,0,0,0,{"$f":"SUM(B61:Y61)","v":47.847516876391204}]
["Markrefl. mot ytan",{"$f":"$F$8*B58*(1-COS($C$7*PI()/180))/2","v":0},{"$f":"$F$8*C58*(1-COS($C$7*PI()/180))/2","v":0},0,0,4.7840468869957992E-2,0.23489960727710674,0.42195874568425601,0.59627011293880006,0.74595467742549637,0.8608116834400158,0.9330138158326452,0.95764061860049299,0.93301381583264542,0.86081168344001613,0.74595467742549693,0.5962701129387995,0.42195874568425573,0.23489960727710704,4.7840468869958304E-2,0,0,0,0,0,8.6391388415370507]
["Summa mot ytan",{"$f":"SUM(B60:B62)","v":0},{"$f":"SUM(C60:C62)","v":0},0,0,0.62860687703115725,2.4767621395536277,5.8949067149282319,9.5281339415725377,12.788949418766697,15.33926856485542,16.956920698275752,17.510712793887453,16.956920698275752,15.339268564855423,12.788949418766698,9.5281339415725341,5.8949067149282275,2.4767621395536343,0.62860687703116114,0,0,0,0,0,{"$f":"SUM(B63:Y63)","v":144.73780950385432},0.12093372689762599]
[]
["Maj",{"$f":"'Mot marken'!B63","v":"deklination"},null,{"$f":"'Mot marken'!C63","v":19.899999999999999}]
["Kl",{"$f":"'Mot marken'!B64","v":1},{"$f":"IF(Luleå!C199<0,0,Luleå!C199)","v":2},{"$f":"IF(Luleå!D199<0,0,Luleå!D199)","v":3},{"$f":"IF(Luleå!E199<0,0,Luleå!E199)","v":4},{"$f":"IF(Luleå!F199<0,0,Luleå!F199)","v":5},{"$f":"IF(Luleå!G199<0,0,Luleå!G199)","v":6},{"$f":"IF(Luleå!H199<0,0,Luleå!H199)","v":7},{"$f":"IF(Luleå!I199<0,0,Luleå!I199)","v":8},{"$f":"IF(Luleå!J199<0,0,Luleå!J199)","v":9},{"$f":"IF(Luleå!K199<0,0,Luleå!K199)","v":10},{"$f":"IF(Luleå!L199<0,0,Luleå!L199)","v":11},{"$f":"IF(Luleå!M199<0,0,Luleå!M199)","v":12},{"$f":"IF(Luleå!N199<0,0,Luleå!N199)","v":13},{"$f":"IF(Luleå!O199<0,0,Luleå!O199)","v":14},{"$f":"IF(Luleå!P199<0,0,Luleå!P199)","v":15},{"$f":"IF(Luleå!Q199<0,0,Luleå!Q199)","v":16},{"$f":"IF(Luleå!R199<0,0,Luleå!R199)","v":17},{"$f":"IF(Luleå!S199<0,0,Luleå!S199)","v":18},{"$f":"IF(Luleå!T199<0,0,Luleå!T199)","v":19},{"$f":"IF(Luleå!U199<0,0,Luleå!U199)","v":20},{"$f":"IF(Luleå!V199<0,0,Luleå!V199)","v":21},{"$f":"IF(Luleå!W199<0,0,Luleå!W199)","v":22},{"$f":"IF(Luleå!X199<0,0,Luleå!X199)","v":23},{"$f":"IF(Luleå!Y199<0,0,Luleå!Y199)","v":24}]
["solhöjd",{"$f":"IF('Mot marken'!B65<0,0,'Mot marken'!B65)","v":0},{"$f":"IF('Mot marken'!C65<0,0,'Mot marken'!C65)","v":0},{"$f":"IF('Mot marken'!D65<0,0,'Mot marken'!D65)","v":0},{"$f":"IF('Mot marken'!E65<0,0,'Mot marken'!E65)","v":3.0487002796175067},{"$f":"IF('Mot marken'!F65<0,0,'Mot marken'!F65)","v":9.7171337135258682},{"$f":"IF('Mot marken'!G65<0,0,'Mot marken'!G65)","v":17.02791296217702},{"$f":"IF('Mot marken'!H65<0,0,'Mot marken'!H65)","v":24.63845678089859},{"$f":"IF('Mot marken'!I65<0,0,'Mot marken'!I65)","v":32.173873308672},{"$f":"IF('Mot marken'!J65<0,0,'Mot marken'!J65)","v":39.179929280617458},{"$f":"IF('Mot marken'!K65<0,0,'Mot marken'!K65)","v":45.066612242610944},{"$f":"IF('Mot marken'!L65<0,0,'Mot marken'!L65)","v":49.096302966539014},{"$f":"IF('Mot marken'!M65<0,0,'Mot marken'!M65)","v":50.546735000000012},{"$f":"IF('Mot marken'!N65<0,0,'Mot marken'!N65)","v":49.096302966539028},{"$f":"IF('Mot marken'!O65<0,0,'Mot marken'!O65)","v":45.066612242610979},{"$f":"IF('Mot marken'!P65<0,0,'Mot marken'!P65)","v":39.179929280617486},{"$f":"IF('Mot marken'!Q65<0,0,'Mot marken'!Q65)","v":32.173873308671979},{"$f":"IF('Mot marken'!R65<0,0,'Mot marken'!R65)","v":24.638456780898576},{"$f":"IF('Mot marken'!S65<0,0,'Mot marken'!S65)","v":17.027912962177037},{"$f":"IF('Mot marken'!T65<0,0,'Mot marken'!T65)","v":9.7171337135258806},{"$f":"IF('Mot marken'!U65<0,0,'Mot marken'!U65)","v":3.0487002796175409},{"$f":"IF('Mot marken'!V65<0,0,'Mot marken'!V65)","v":0},{"$f":"IF('Mot marken'!W65<0,0,'Mot marken'!W65)","v":0},{"$f":"IF('Mot marken'!X65<0,0,'Mot marken'!X65)","v":0},{"$f":"IF('Mot marken'!Y65<0,0,'Mot marken'!Y65)","v":0}]
["azimut",{"$f":"'Mot marken'!B66","v":-165.70200608037672},{"$f":"'Mot marken'!C66","v":-151.72543495471905},{"$f":"'Mot marken'!D66","v":-138.27230213382293},{"$f":"'Mot marken'!E66","v":-125.36638209450021},{"$f":"'Mot marken'!F66","v":-112.85822682976811},{"$f":"'Mot marken'!G66","v":-100.45487398239898},{"$f":"'Mot marken'!H66","v":-87.738566648820495},{"$f":"'Mot marken'!I66","v":-74.164584879818065},{"$f":"'Mot marken'!J66","v":-59.062815076000632},{"$f":"'Mot marken'!K66","v":-41.732860268174782},{"$f":"'Mot marken'!L66","v":-21.8185371931928},{"$f":"'Mot marken'!M66","v":0},{"$f":"'Mot marken'!N66","v":21.81853719319281},{"$f":"'Mot marken'!O66","v":41.732860268174811},{"$f":"'Mot marken'!P66","v":59.062815076000653},{"$f":"'Mot marken'!Q66","v":74.164584879818008},{"$f":"'Mot marken'!R66","v":87.738566648820495},{"$f":"'Mot marken'!S66","v":100.45487398239898},{"$f":"'Mot marken'!T66","v":112.85822682976811},{"$f":"'Mot marken'!U66","v":125.36638209450021},{"$f":"'Mot marken'!V66","v":138.2723021338229},{"$f":"'Mot marken'!W66","v":151.72543495471905},{"$f":"'Mot marken'!X66","v":165.70200608037672},{"$f":"'Mot marken'!Y66","v":180},"Summa"]
["Uppmätt IDN förd",{"$f":"'Mot marken'!B69","v":0},{"$f":"'Mot marken'!C69","v":0},{"$f":"'Mot marken'!D69","v":0},{"$f":"'Mot marken'!E69","v":1.3259396315853433},{"$f":"'Mot marken'!F69","v":6.9820231310026033},{"$f":"'Mot marken'!G69","v":9.6514801783735713},{"$f":"'Mot marken'!H69","v":11.003299014375614},{"$f":"'Mot marken'!I69","v":11.767843100035243},{"$f":"'Mot marken'!J69","v":12.224429671140509},{"$f":"'Mot marken'!K69","v":12.495976799129645},{"$f":"'Mot marken'!L69","v":12.64106974971806},{"$f":"'Mot marken'!M69","v":12.686787449278752},{"$f":"'Mot marken'!N69","v":12.64106974971806},{"$f":"'Mot marken'!O69","v":12.495976799129645},{"$f":"'Mot marken'!P69","v":12.224429671140509},{"$f":"'Mot marken'!Q69","v":11.76784310003524},{"$f":"'Mot marken'!R69","v":11.003299014375614},{"$f":"'Mot marken'!S69","v":9.6514801783735784},{"$f":"'Mot marken'!T69","v":6.9820231310026104},{"$f":"'Mot marken'!U69","v":1.3259396315853795},{"$f":"'Mot marken'!V69","v":0},{"$f":"'Mot marken'!W69","v":0},{"$f":"'Mot marken'!X69","v":0},{"$f":"'Mot marken'!Y69","v":0},{"$f":"SUM(B69:Y69)","v":168.87091000000001}]
["Global IDH + IdH förd",{"$f":"'Mot marken'!B73","v":0},{"$f":"'Mot marken'!C73","v":0},{"$f":"'Mot marken'!D73","v":0},{"$f":"'Mot marken'!E73","v":1.0824706506948063},{"$f":"'Mot marken'!F73","v":3.4352679136119111},{"$f":"'Mot marken'!G73","v":5.9601303811598898},{"$f":"'Mot marken'!H73","v":8.4849928487078792},{"$f":"'Mot marken'!I73","v":10.837790111624978},{"$f":"'Mot marken'!J73","v":12.858182924624703},{"$f":"'Mot marken'!K73","v":14.408484856358124},{"$f":"'Mot marken'!L73","v":15.383045392172685},{"$f":"'Mot marken'!M73","v":15.715449842090051},{"$f":"'Mot marken'!N73","v":15.38304539217269},{"$f":"'Mot marken'!O73","v":14.408484856358132},{"$f":"'Mot marken'!P73","v":12.858182924624716},{"$f":"'Mot marken'!Q73","v":10.837790111624969},{"$f":"'Mot marken'!R73","v":8.4849928487078721},{"$f":"'Mot marken'!S73","v":5.960130381159896},{"$f":"'Mot marken'!T73","v":3.4352679136119151},{"$f":"'Mot marken'!U73","v":1.0824706506948183},{"$f":"'Mot marken'!V73","v":0},{"$f":"'Mot marken'!W73","v":0},{"$f":"'Mot marken'!X73","v":0},{"$f":"'Mot marken'!Y73","v":0},{"$f":"SUM(B70:Y70)","v":160.61618000000004}]
["Diffusstrål IdH",{"$f":"'Mot marken'!B74","v":0},{"$f":"'Mot marken'!C74","v":0},{"$f":"'Mot marken'!D74","v":0},{"$f":"'Mot marken'!E74","v":1.0119508794358691},{"$f":"'Mot marken'!F74","v":2.2568131683482351},{"$f":"'Mot marken'!G74","v":3.1338145143705707},{"$f":"'Mot marken'!H74","v":3.8978167899798368},{"$f":"'Mot marken'!I74","v":4.5715271108842055},{"$f":"'Mot marken'!J74","v":5.1353041203815115},{"$f":"'Mot marken'!K74","v":5.5622281500091848},{"$f":"'Mot marken'!L74","v":5.8287830402952672},{"$f":"'Mot marken'!M74","v":5.9194336567394696},{"$f":"'Mot marken'!N74","v":5.8287830402952707},{"$f":"'Mot marken'!O74","v":5.5622281500091901},{"$f":"'Mot marken'!P74","v":5.1353041203815177},{"$f":"'Mot marken'!Q74","v":4.5715271108842028},{"$f":"'Mot marken'!R74","v":3.8978167899798324},{"$f":"'Mot marken'!S74","v":3.1338145143705725},{"$f":"'Mot marken'!T74","v":2.2568131683482364},{"$f":"'Mot marken'!U74","v":1.0119508794358785},{"$f":"'Mot marken'!V74","v":0},{"$f":"'Mot marken'!W74","v":0},{"$f":"'Mot marken'!X74","v":0},{"$f":"'Mot marken'!Y74","v":0},{"$f":"SUM(B71:Y71)","v":68.715909204148844}]
["Direkt mot ytan",{"$f":"IF(B67<$L$10,0,IF(AND(B68>$L8,B68<$M8,B69<$L9),0,IF(SIN(B67*PI()/180)*(COS($C$7*PI()/180))+COS(B67*PI()/180)*SIN($C$7*PI()/180)*(COS((B68-($C$8-180))*PI()/180))<0,0,B69*(SIN(B67*PI()/180)*(COS($C$7*PI()/180))+COS(B67*PI()/180)*SIN($C$7*PI()/180)*(COS((B68-($C$8-180))*PI()/180))))))","v":0},0,0,0,0,0.81439195278764243,3.5226844672723572,6.352856526563631,8.905621924286514,10.912426384525023,{"$f":"IF(L67<$L$10,0,IF(AND(L68>$L8,L68<$M8,L69<$L9),0,IF(SIN(L67*PI()/180)*(COS($C$7*PI()/180))+COS(L67*PI()/180)*SIN($C$7*PI()/180)*(COS((L68-($C$8-180))*PI()/180))<0,0,L69*(SIN(L67*PI()/180)*(COS($C$7*PI()/180))+COS(L67*PI()/180)*SIN($C$7*PI()/180)*(COS((L68-($C$8-180))*PI()/180))))))","v":12.189508477260873},{"$f":"IF(M67<$L$10,0,IF(AND(M68>$L8,M68<$M8,M69<$L9),0,IF(SIN(M67*PI()/180)*(COS($C$7*PI()/180))+COS(M67*PI()/180)*SIN($C$7*PI()/180)*(COS((M68-($C$8-180))*PI()/180))<0,0,M69*(SIN(M67*PI()/180)*(COS($C$7*PI()/180))+COS(M67*PI()/180)*SIN($C$7*PI()/180)*(COS((M68-($C$8-180))*PI()/180))))))","v":12.627383949793776},12.189508477260873,10.912426384525022,8.905621924286514,6.3528565265636328,3.5226844672723558,0.81439195278764509,0,0,0,0,0,0,{"$f":"SUM(B72:Y72)","v":98.02236341518585},null,"Maj"]
["Diffus mot ytan",{"$f":"(B71)*(2+(COS($C$7*PI()/180)))/3","v":0},{"$f":"(C71)*(2+(COS($C$7*PI()/180)))/3","v":0},0,0.91315302931617726,2.0364780773022013,2.8278568409444662,3.5172687546590655,4.1252040140842592,4.633938869246669,5.0191818477988566,5.2597126981494862,5.341512997647766,5.2597126981494897,5.019181847798861,4.6339388692466752,4.1252040140842565,3.5172687546590615,2.827856840944468,2.0364780773022026,0.91315302931618569,0,0,0,0,{"$f":"SUM(B73:Y73)","v":62.007101260650153}]
["Markrefl. mot ytan",{"$f":"$F$7*B70*(1-COS($C$7*PI()/180))/2","v":0},{"$f":"$F$7*C70*(1-COS($C$7*PI()/180))/2","v":0},0,3.1704831315309413E-2,0.10061666767043657,0.17456817718857695,0.24851968670671759,0.31743152306184458,0.3766074584885501,0.42201475078036155,0.45055896800669054,0.46029486893511179,0.45055896800669071,0.42201475078036182,0.37660745848855048,0.3174315230618443,0.2485196867067174,0.17456817718857712,0.10061666767043669,3.1704831315309767E-2,0,0,0,0,4.7043389953720869]
["Summa mot ytan",{"$f":"SUM(B72:B74)","v":0},{"$f":"SUM(C72:C74)","v":0},0,0.94485786063148669,2.1370947449726381,3.8168169709206858,7.2884729086381403,10.795492063709736,13.916168252021734,16.353622983104241,17.899780143417047,18.429191816376655,17.89978014341705,16.353622983104245,13.916168252021739,10.795492063709732,7.288472908638135,3.8168169709206903,2.1370947449726394,0.94485786063149546,0,0,0,0,{"$f":"SUM(B75:Y75)","v":164.73380367120808},0.13764111044841054]
[null,null,null,null,null,null,null,null,null,null,null,null,null,null,null,null,null,null,null,null,null,null,null,{"$f":"SIN(C79*PI()/180)/(ABS(COS(($C$8-180)))*(PI()/180)-SIN($C$7*PI()/180<0))","v":0}]
["Juni",{"$f":"'Mot marken'!B76","v":"deklination"},null,{"$f":"'Mot marken'!C76","v":23.45}]
["Kl",{"$f":"'Mot marken'!B77","v":1},{"$f":"'Mot marken'!C77","v":2},{"$f":"'Mot marken'!D77","v":3},{"$f":"'Mot marken'!E77","v":4},{"$f":"'Mot marken'!F77","v":5},{"$f":"'Mot marken'!G77","v":6},{"$f":"'Mot marken'!H77","v":7},{"$f":"'Mot marken'!I77","v":8},{"$f":"'Mot marken'!J77","v":9},{"$f":"'Mot marken'!K77","v":10},{"$f":"'Mot marken'!L77","v":11},{"$f":"'Mot marken'!M77","v":12},{"$f":"'Mot marken'!N77","v":13},{"$f":"'Mot marken'!O77","v":14},{"$f":"'Mot marken'!P77","v":15},{"$f":"'Mot marken'!Q77","v":16},{"$f":"'Mot marken'!R77","v":17},{"$f":"'Mot marken'!S77","v":18},{"$f":"'Mot marken'!T77","v":19},{"$f":"'Mot marken'!U77","v":20},{"$f":"'Mot marken'!V77","v":21},{"$f":"'Mot marken'!W77","v":22},{"$f":"'Mot marken'!X77","v":23},{"$f":"'Mot marken'!Y77","v":24}]
["solhöjd",{"$f":"IF('Mot marken'!B78<0,0,'Mot marken'!B78)","v":0},{"$f":"IF('Mot marken'!C78<0,0,'Mot marken'!C78)","v":0},{"$f":"IF('Mot marken'!D78<0,0,'Mot marken'!D78)","v":0.66995235678519172},{"$f":"IF('Mot marken'!E78<0,0,'Mot marken'!E78)","v":6.2314210671404107},{"$f":"IF('Mot marken'!F78<0,0,'Mot marken'!F78)","v":12.787220364037859},{"$f":"IF('Mot marken'!G78<0,0,'Mot marken'!G78)","v":20.0210748737248},{"$f":"IF('Mot marken'!H78<0,0,'Mot marken'!H78)","v":27.606756688937775},{"$f":"IF('Mot marken'!I78<0,0,'Mot marken'!I78)","v":35.18280056404322},{"$f":"IF('Mot marken'!J78<0,0,'Mot marken'!J78)","v":42.302045542620405},{"$f":"IF('Mot marken'!K78<0,0,'Mot marken'!K78)","v":48.361863859379277},{"$f":"IF('Mot marken'!L78<0,0,'Mot marken'!L78)","v":52.567851086295448},{"$f":"IF('Mot marken'!M78<0,0,'Mot marken'!M78)","v":54.096735000000002},{"$f":"IF('Mot marken'!N78<0,0,'Mot marken'!N78)","v":52.56785108629547},{"$f":"IF('Mot marken'!O78<0,0,'Mot marken'!O78)","v":48.361863859379305},{"$f":"IF('Mot marken'!P78<0,0,'Mot marken'!P78)","v":42.302045542620434},{"$f":"IF('Mot marken'!Q78<0,0,'Mot marken'!Q78)","v":35.182800564043205},{"$f":"IF('Mot marken'!R78<0,0,'Mot marken'!R78)","v":27.606756688937757},{"$f":"IF('Mot marken'!S78<0,0,'Mot marken'!S78)","v":20.021074873724814},{"$f":"IF('Mot marken'!T78<0,0,'Mot marken'!T78)","v":12.787220364037871},{"$f":"IF('Mot marken'!U78<0,0,'Mot marken'!U78)","v":6.2314210671404409},{"$f":"IF('Mot marken'!V78<0,0,'Mot marken'!V78)","v":0.66995235678518539},{"$f":"IF('Mot marken'!W78<0,0,'Mot marken'!W78)","v":0},{"$f":"IF('Mot marken'!X78<0,0,'Mot marken'!X78)","v":0},{"$f":"IF('Mot marken'!Y78<0,0,'Mot marken'!Y78)","v":0}]
["azimut",{"$f":"'Mot marken'!B79","v":-166.17985811190209},{"$f":"'Mot marken'!C79","v":-152.63831480285143},{"$f":"'Mot marken'!D79","v":-139.55261015033997},{"$f":"'Mot marken'!E79","v":-126.94427030010894},{"$f":"'Mot marken'!F79","v":-114.67583985750626},{"$f":"'Mot marken'!G79","v":-102.46828376327311},{"$f":"'Mot marken'!H79","v":-89.907767246644823},{"$f":"'Mot marken'!I79","v":-76.429023374740567},{"$f":"'Mot marken'!J79","v":-61.293822820209357},{"$f":"'Mot marken'!K79","v":-43.660071060218229},{"$f":"'Mot marken'!L79","v":-22.994655248286637},{"$f":"'Mot marken'!M79","v":0},{"$f":"'Mot marken'!N79","v":22.994655248286644},{"$f":"'Mot marken'!O79","v":43.660071060218264},{"$f":"'Mot marken'!P79","v":61.293822820209421},{"$f":"'Mot marken'!Q79","v":76.42902337474051},{"$f":"'Mot marken'!R79","v":89.907767246632972},{"$f":"'Mot marken'!S79","v":102.46828376327306},{"$f":"'Mot marken'!T79","v":114.67583985750625},{"$f":"'Mot marken'!U79","v":126.94427030010893},{"$f":"'Mot marken'!V79","v":139.55261015033997},{"$f":"'Mot marken'!W79","v":152.63831480285143},{"$f":"'Mot marken'!X79","v":166.17985811190209},{"$f":"'Mot marken'!Y79","v":180},"Summa"]
["Uppmätt IDN förd",{"$f":"'Mot marken'!B82","v":0},{"$f":"'Mot marken'!C82","v":0},{"$f":"'Mot marken'!D82","v":2.4922957670072928E-4},{"$f":"'Mot marken'!E82","v":4.6974648466055644},{"$f":"'Mot marken'!F82","v":8.6075331739283119},{"$f":"'Mot marken'!G82","v":10.57703624731689},{"$f":"'Mot marken'!H82","v":11.670897881967095},{"$f":"'Mot marken'!I82","v":12.324505783287533},{"$f":"'Mot marken'!J82","v":12.728038373077208},{"$f":"'Mot marken'!K82","v":12.972954558944329},{"$f":"'Mot marken'!L82","v":13.105366922112568},{"$f":"'Mot marken'!M82","v":13.147315966367563},{"$f":"'Mot marken'!N82","v":13.105366922112568},{"$f":"'Mot marken'!O82","v":12.972954558944329},{"$f":"'Mot marken'!P82","v":12.728038373077208},{"$f":"'Mot marken'!Q82","v":12.324505783287533},{"$f":"'Mot marken'!R82","v":11.670897881967095},{"$f":"'Mot marken'!S82","v":10.577036247316894},{"$f":"'Mot marken'!T82","v":8.607533173928319},{"$f":"'Mot marken'!U82","v":4.6974648466055937},{"$f":"'Mot marken'!V82","v":2.4922957670070315E-4},{"$f":"'Mot marken'!W82","v":0},{"$f":"'Mot marken'!X82","v":0},{"$f":"'Mot marken'!Y82","v":0},{"$f":"SUM(B81:Y81)","v":186.51540999999997}]
["Global IDH + IdH förd",{"$f":"'Mot marken'!B86","v":0},{"$f":"'Mot marken'!C86","v":0},{"$f":"'Mot marken'!D86","v":0.23711934174086091},{"$f":"'Mot marken'!E86","v":2.2012204775550126},{"$f":"'Mot marken'!F86","v":4.4884646939778552},{"$f":"'Mot marken'!G86","v":6.9429800775099446},{"$f":"'Mot marken'!H86","v":9.3974954610420394},{"$f":"'Mot marken'!I86","v":11.684739677464876},{"$f":"'Mot marken'!J86","v":13.648840813279026},{"$f":"'Mot marken'!K86","v":15.155948621909351},{"$f":"'Mot marken'!L86","v":16.10335619681112},{"$f":"'Mot marken'!M86","v":16.426499277419804},{"$f":"'Mot marken'!N86","v":16.103356196811124},{"$f":"'Mot marken'!O86","v":15.155948621909358},{"$f":"'Mot marken'!P86","v":13.648840813279033},{"$f":"'Mot marken'!Q86","v":11.684739677464869},{"$f":"'Mot marken'!R86","v":9.3974954610420358},{"$f":"'Mot marken'!S86","v":6.9429800775099482},{"$f":"'Mot marken'!T86","v":4.4884646939778605},{"$f":"'Mot marken'!U86","v":2.2012204775550233},{"$f":"'Mot marken'!V86","v":0.23711934174085861},{"$f":"'Mot marken'!W86","v":0},{"$f":"'Mot marken'!X86","v":0},{"$f":"'Mot marken'!Y86","v":0},176.14682999999999]
["Diffusstrål IdH",{"$f":"'Mot marken'!B87","v":0},{"$f":"'Mot marken'!C87","v":0},{"$f":"'Mot marken'!D87","v":0.23711642759711576},{"$f":"'Mot marken'!E87","v":1.6913363499798071},{"$f":"'Mot marken'!F87","v":2.5833508702780907},{"$f":"'Mot marken'!G87","v":3.3217649871444395},{"$f":"'Mot marken'!H87","v":3.9891950947647645},{"$f":"'Mot marken'!I87","v":4.5835197364216134},{"$f":"'Mot marken'!J87","v":5.0823756258487389},{"$f":"'Mot marken'!K87","v":5.4605330026997976},{"$f":"'Mot marken'!L87","v":5.6967290705440288},{"$f":"'Mot marken'!M87","v":5.777065211908786},{"$f":"'Mot marken'!N87","v":5.6967290705440288},{"$f":"'Mot marken'!O87","v":5.4605330026997994},{"$f":"'Mot marken'!P87","v":5.0823756258487425},{"$f":"'Mot marken'!Q87","v":4.5835197364216107},{"$f":"'Mot marken'!R87","v":3.9891950947647645},{"$f":"'Mot marken'!S87","v":3.3217649871444395},{"$f":"'Mot marken'!T87","v":2.5833508702780925},{"$f":"'Mot marken'!U87","v":1.691336349979812},{"$f":"'Mot marken'!V87","v":0.23711642759711346},{"$f":"'Mot marken'!W87","v":0},{"$f":"'Mot marken'!X87","v":0},{"$f":"'Mot marken'!Y87","v":0},{"$f":"SUM(B83:Y83)","v":71.068907542465581}]
["Direkt mot ytan",{"$f":"IF(B79<$L$10,0,IF(AND(B80>$L8,B80<$M8,B79<$L9),0,IF(SIN(B79*PI()/180)*(COS($C$7*PI()/180))+COS(B79*PI()/180)*SIN($C$7*PI()/180)*(COS((B80-($C$8-180))*PI()/180))<0,0,B81*(SIN(B79*PI()/180)*(COS($C$7*PI()/180))+COS(B79*PI()/180)*SIN($C$7*PI()/180)*(COS((B80-($C$8-180))*PI()/180))))))","v":0},0,0,0,0,1.0434390803802713,3.8360180830537685,6.6926637832699187,9.2546545371446438,11.265065369980379,{"$f":"IF(L79<$L$10,0,IF(AND(L80>$L8,L80<$M8,L79<$L9),0,IF(SIN(L79*PI()/180)*(COS($C$7*PI()/180))+COS(L79*PI()/180)*SIN($C$7*PI()/180)*(COS((L80-($C$8-180))*PI()/180))<0,0,L81*(SIN(L79*PI()/180)*(COS($C$7*PI()/180))+COS(L79*PI()/180)*SIN($C$7*PI()/180)*(COS((L80-($C$8-180))*PI()/180))))))","v":12.543653399749056},{"$f":"IF(M79<$L$10,0,IF(AND(M80>$L8,M80<$M8,M79<$L9),0,IF(SIN(M79*PI()/180)*(COS($C$7*PI()/180))+COS(M79*PI()/180)*SIN($C$7*PI()/180)*(COS((M80-($C$8-180))*PI()/180))<0,0,M81*(SIN(M79*PI()/180)*(COS($C$7*PI()/180))+COS(M79*PI()/180)*SIN($C$7*PI()/180)*(COS((M80-($C$8-180))*PI()/180))))))","v":12.981959777822636},12.543653399749054,11.265065369980375,9.2546545371446385,6.6926637832699241,3.8360180830552779,1.0434390803802782,0,0,0,0,0,0,{"$f":"SUM(B84:Y84)","v":102.25294828498023},null,"Juni"]
["Diffus mot ytan",{"$f":"(B83)*(2+(COS($C$7*PI()/180)))/3","v":0},{"$f":"(C83)*(2+(COS($C$7*PI()/180)))/3","v":0},0.21396649635962703,1.5262093674325465,2.331135553037996,2.9974575074022525,3.5997256975046024,4.1360257867231089,4.5861778404241145,4.9274153068338542,5.1405512991507596,5.2130441368383913,5.1405512991507596,4.9274153068338551,4.586177840424118,4.1360257867231063,3.5997256975046024,2.9974575074022525,2.3311355530379978,1.5262093674325508,0.21396649635962495,0,0,0,{"$f":"SUM(B85:Y85)","v":64.13037384657612}]
["Markrefl. mot ytan",{"$f":"$F$7*B82*(1-COS($C$7*PI()/180))/2","v":0},{"$f":"$F$7*C82*(1-COS($C$7*PI()/180))/2","v":0},6.9450647245407789E-3,6.4472255098917255E-2,0.13146408717497118,0.20335517830595612,0.27524626943694125,0.342238101512995,0.39976529188737137,0.44390745760423383,0.47165638301835644,0.48112102472003376,0.47165638301835661,0.44390745760423406,0.39976529188737164,0.34223810151299472,0.27524626943694108,0.2033551783059562,0.13146408717497132,6.4472255098917575E-2,6.9450647245407103E-3,0,0,0,5.1592212022486006]
["Summa mot ytan",{"$f":"SUM(B84:B86)","v":0},{"$f":"SUM(C84:C86)","v":0},0.22091156108416782,1.5906816225314637,2.4625996402129671,4.24425176608848,7.7109900499953117,11.170927671506023,14.240597669456131,16.636388134418468,18.155861081918172,18.676124939381062,18.155861081918168,16.636388134418464,14.240597669456127,11.170927671506027,7.7109900499968216,4.2442517660884862,2.4625996402129693,1.5906816225314684,0.22091156108416565,0,0,0,{"$f":"SUM(B87:Y87)","v":171.54254333380496},0.14333006114965491]
[]
["Juli",{"$f":"'Mot marken'!B89","v":"deklination"},null,{"$f":"'Mot marken'!C89","v":19.899999999999999}]
["Kl",{"$f":"'Mot marken'!B90","v":1},{"$f":"'Mot marken'!C90","v":2},{"$f":"'Mot marken'!D90","v":3},{"$f":"'Mot marken'!E90","v":4},{"$f":"'Mot marken'!F90","v":5},{"$f":"'Mot marken'!G90","v":6},{"$f":"'Mot marken'!H90","v":7},{"$f":"'Mot marken'!I90","v":8},{"$f":"'Mot marken'!J90","v":9},{"$f":"'Mot marken'!K90","v":10},{"$f":"'Mot marken'!L90","v":11},{"$f":"'Mot marken'!M90","v":12},{"$f":"'Mot marken'!N90","v":13},{"$f":"'Mot marken'!O90","v":14},{"$f":"'Mot marken'!P90","v":15},{"$f":"'Mot marken'!Q90","v":16},{"$f":"'Mot marken'!R90","v":17},{"$f":"'Mot marken'!S90","v":18},{"$f":"'Mot marken'!T90","v":19},{"$f":"'Mot marken'!U90","v":20},{"$f":"'Mot marken'!V90","v":21},{"$f":"'Mot marken'!W90","v":22},{"$f":"'Mot marken'!X90","v":23},{"$f":"'Mot marken'!Y90","v":24}]
["solhöjd",{"$f":"IF('Mot marken'!B91<0,0,'Mot marken'!B91)","v":0},{"$f":"IF('Mot marken'!C91<0,0,'Mot marken'!C91)","v":0},{"$f":"IF('Mot marken'!D91<0,0,'Mot marken'!D91)","v":0},{"$f":"IF('Mot marken'!E91<0,0,'Mot marken'!E91)","v":3.0487002796175067},{"$f":"IF('Mot marken'!F91<0,0,'Mot marken'!F91)","v":9.7171337135258682},{"$f":"IF('Mot marken'!G91<0,0,'Mot marken'!G91)","v":17.02791296217702},{"$f":"IF('Mot marken'!H91<0,0,'Mot marken'!H91)","v":24.63845678089859},{"$f":"IF('Mot marken'!I91<0,0,'Mot marken'!I91)","v":32.173873308672},{"$f":"IF('Mot marken'!J91<0,0,'Mot marken'!J91)","v":39.179929280617458},{"$f":"IF('Mot marken'!K91<0,0,'Mot marken'!K91)","v":45.066612242610944},{"$f":"IF('Mot marken'!L91<0,0,'Mot marken'!L91)","v":49.096302966539014},{"$f":"IF('Mot marken'!M91<0,0,'Mot marken'!M91)","v":50.546735000000012},{"$f":"IF('Mot marken'!N91<0,0,'Mot marken'!N91)","v":49.096302966539028},{"$f":"IF('Mot marken'!O91<0,0,'Mot marken'!O91)","v":45.066612242610979},{"$f":"IF('Mot marken'!P91<0,0,'Mot marken'!P91)","v":39.179929280617486},{"$f":"IF('Mot marken'!Q91<0,0,'Mot marken'!Q91)","v":32.173873308671979},{"$f":"IF('Mot marken'!R91<0,0,'Mot marken'!R91)","v":24.638456780898576},{"$f":"IF('Mot marken'!S91<0,0,'Mot marken'!S91)","v":17.027912962177037},{"$f":"IF('Mot marken'!T91<0,0,'Mot marken'!T91)","v":9.7171337135258806},{"$f":"IF('Mot marken'!U91<0,0,'Mot marken'!U91)","v":3.0487002796175409},{"$f":"IF('Mot marken'!V91<0,0,'Mot marken'!V91)","v":0},{"$f":"IF('Mot marken'!W91<0,0,'Mot marken'!W91)","v":0},{"$f":"IF('Mot marken'!X91<0,0,'Mot marken'!X91)","v":0},{"$f":"IF('Mot marken'!Y91<0,0,'Mot marken'!Y91)","v":0}]
["azimut",{"$f":"'Mot marken'!B92","v":-165.70200608037672},{"$f":"'Mot marken'!C92","v":-151.72543495471905},{"$f":"'Mot marken'!D92","v":-138.27230213382293},{"$f":"'Mot marken'!E92","v":-125.36638209450021},{"$f":"'Mot marken'!F92","v":-112.85822682976811},{"$f":"'Mot marken'!G92","v":-100.45487398239898},{"$f":"'Mot marken'!H92","v":-87.738566648820495},{"$f":"'Mot marken'!I92","v":-74.164584879818065},{"$f":"'Mot marken'!J92","v":-59.062815076000632},{"$f":"'Mot marken'!K92","v":-41.732860268174782},{"$f":"'Mot marken'!L92","v":-21.8185371931928},{"$f":"'Mot marken'!M92","v":0},{"$f":"'Mot marken'!N92","v":21.81853719319281},{"$f":"'Mot marken'!O92","v":41.732860268174811},{"$f":"'Mot marken'!P92","v":59.062815076000653},{"$f":"'Mot marken'!Q92","v":74.164584879818008},{"$f":"'Mot marken'!R92","v":87.738566648820495},{"$f":"'Mot marken'!S92","v":100.45487398239898},{"$f":"'Mot marken'!T92","v":112.85822682976811},{"$f":"'Mot marken'!U92","v":125.36638209450021},{"$f":"'Mot marken'!V92","v":138.2723021338229},{"$f":"'Mot marken'!W92","v":151.72543495471905},{"$f":"'Mot marken'!X92","v":165.70200608037672},{"$f":"'Mot marken'!Y92","v":180},"Summa"]
["Uppmätt IDN förd",{"$f":"'Mot marken'!B95","v":0},{"$f":"'Mot marken'!C95","v":0},{"$f":"'Mot marken'!D95","v":0},{"$f":"'Mot marken'!E95","v":1.4361006182746887},{"$f":"'Mot marken'!F95","v":7.5620997339467797},{"$f":"'Mot marken'!G95","v":10.453339142488753},{"$f":"'Mot marken'!H95","v":11.917469046997871},{"$f":"'Mot marken'!I95","v":12.745532563585941},{"$f":"'Mot marken'!J95","v":13.24005300889174},{"$f":"'Mot marken'!K95","v":13.534160665912035},{"$f":"'Mot marken'!L95","v":13.691308149163731},{"$f":"'Mot marken'!M95","v":13.740824141476825},{"$f":"'Mot marken'!N95","v":13.691308149163731},{"$f":"'Mot marken'!O95","v":13.534160665912035},{"$f":"'Mot marken'!P95","v":13.24005300889174},{"$f":"'Mot marken'!Q95","v":12.74553256358594},{"$f":"'Mot marken'!R95","v":11.917469046997871},{"$f":"'Mot marken'!S95","v":10.453339142488762},{"$f":"'Mot marken'!T95","v":7.5620997339467868},{"$f":"'Mot marken'!U95","v":1.4361006182747276},{"$f":"'Mot marken'!V95","v":0},{"$f":"'Mot marken'!W95","v":0},{"$f":"'Mot marken'!X95","v":0},{"$f":"'Mot marken'!Y95","v":0},{"$f":"SUM(B93:Y93)","v":182.90094999999999}]
["Global IDH + IdH förd",{"$f":"'Mot marken'!B99","v":0},{"$f":"'Mot marken'!C99","v":0},{"$f":"'Mot marken'!D99","v":0},{"$f":"'Mot marken'!E99","v":1.1432351456297998},{"$f":"'Mot marken'!F99","v":3.6281066936777089},{"$f":"'Mot marken'!G99","v":6.2947023274065872},{"$f":"'Mot marken'!H99","v":8.9612979611354771},{"$f":"'Mot marken'!I99","v":11.446169509183379},{"$f":"'Mot marken'!J99","v":13.579977081995224},{"$f":"'Mot marken'!K99","v":15.217305219767635},{"$f":"'Mot marken'!L99","v":16.246572715724106},{"$f":"'Mot marken'!M99","v":16.597636690960158},{"$f":"'Mot marken'!N99","v":16.24657271572411},{"$f":"'Mot marken'!O99","v":15.217305219767644},{"$f":"'Mot marken'!P99","v":13.579977081995237},{"$f":"'Mot marken'!Q99","v":11.44616950918337},{"$f":"'Mot marken'!R99","v":8.9612979611354717},{"$f":"'Mot marken'!S99","v":6.2947023274065943},{"$f":"'Mot marken'!T99","v":3.6281066936777129},{"$f":"'Mot marken'!U99","v":1.1432351456298124},{"$f":"'Mot marken'!V99","v":0},{"$f":"'Mot marken'!W99","v":0},{"$f":"'Mot marken'!X99","v":0},{"$f":"'Mot marken'!Y99","v":0},{"$f":"SUM(B94:Y94)","v":169.63237000000001}]
["Diffusstrål IdH",{"$f":"'Mot marken'!B100","v":0},{"$f":"'Mot marken'!C100","v":0},{"$f":"'Mot marken'!D100","v":0},{"$f":"'Mot marken'!E100","v":1.0668564895484043},{"$f":"'Mot marken'!F100","v":2.3517442198760676},{"$f":"'Mot marken'!G100","v":3.2335720413446492},{"$f":"'Mot marken'!H100","v":3.9930126658254999},{"$f":"'Mot marken'!I100","v":4.659296294694645},{"$f":"'Mot marken'!J100","v":5.2154703115221839},{"$f":"'Mot marken'!K100","v":5.6360886826204606},{"$f":"'Mot marken'!L100","v":5.8985283976848795},{"$f":"'Mot marken'!M100","v":5.987753280513699},{"$f":"'Mot marken'!N100","v":5.8985283976848795},{"$f":"'Mot marken'!O100","v":5.6360886826204659},{"$f":"'Mot marken'!P100","v":5.2154703115221892},{"$f":"'Mot marken'!Q100","v":4.6592962946946406},{"$f":"'Mot marken'!R100","v":3.9930126658254972},{"$f":"'Mot marken'!S100","v":3.2335720413446509},{"$f":"'Mot marken'!T100","v":2.3517442198760685},{"$f":"'Mot marken'!U100","v":1.0668564895484141},{"$f":"'Mot marken'!V100","v":0},{"$f":"'Mot marken'!W100","v":0},{"$f":"'Mot marken'!X100","v":0},{"$f":"'Mot marken'!Y100","v":0},{"$f":"SUM(B95:Y95)","v":70.096891486747296}]
["Direkt mot ytan",{"$f":"IF(B91<$L$10,0,IF(AND(B92>$L8,B92<$M8,B91<$L9),0,IF(SIN(B91*PI()/180)*(COS($C$7*PI()/180))+COS(B91*PI()/180)*SIN($C$7*PI()/180)*(COS((B92-($C$8-180))*PI()/180))<0,0,B93*(SIN(B91*PI()/180)*(COS($C$7*PI()/180))+COS(B91*PI()/180)*SIN($C$7*PI()/180)*(COS((B92-($C$8-180))*PI()/180))))))","v":0},0,0,0,0,0.88205281677711644,3.8153541993369844,6.8806610559639205,9.6455139034474975,11.819046587329291,{"$f":"IF(L91<$L$10,0,IF(AND(L92>$L8,L92<$M8,L91<$L9),0,IF(SIN(L91*PI()/180)*(COS($C$7*PI()/180))+COS(L91*PI()/180)*SIN($C$7*PI()/180)*(COS((L92-($C$8-180))*PI()/180))<0,0,L93*(SIN(L91*PI()/180)*(COS($C$7*PI()/180))+COS(L91*PI()/180)*SIN($C$7*PI()/180)*(COS((L92-($C$8-180))*PI()/180))))))","v":13.202230511602423},{"$f":"IF(M91<$L$10,0,IF(AND(M92>$L8,M92<$M8,M91<$L9),0,IF(SIN(M91*PI()/180)*(COS($C$7*PI()/180))+COS(M91*PI()/180)*SIN($C$7*PI()/180)*(COS((M92-($C$8-180))*PI()/180))<0,0,M93*(SIN(M91*PI()/180)*(COS($C$7*PI()/180))+COS(M91*PI()/180)*SIN($C$7*PI()/180)*(COS((M92-($C$8-180))*PI()/180))))))","v":13.676485313142646},13.202230511602423,11.819046587329291,9.6455139034474975,6.8806610559639241,3.8153541993369831,0.88205281677711944,0,0,0,0,0,0,{"$f":"SUM(B96:Y96)","v":106.16620346205711},null,"Juli"]
["Diffus mot ytan",{"$f":"(B95)*(2+(COS($C$7*PI()/180)))/3","v":0},{"$f":"(C95)*(2+(COS($C$7*PI()/180)))/3","v":0},0,0.96269814580312019,2.1221409084142566,2.9178749335264427,3.6031705550066615,4.2044041983084091,4.7062783491329396,5.0858312973635345,5.322648741464719,5.4031625032502104,5.322648741464719,5.0858312973635398,4.706278349132945,4.2044041983084055,3.6031705550066593,2.9178749335264436,2.1221409084142571,0.96269814580312885,0,0,0,0,{"$f":"SUM(B97:Y97)","v":63.253256761290388}]
["Markrefl. mot ytan",{"$f":"$F$7*B94*(1-COS($C$7*PI()/180))/2","v":0},{"$f":"$F$7*C94*(1-COS($C$7*PI()/180))/2","v":0},0,3.3484582166417809E-2,0.10626478477098966,0.18436756261466458,0.26247034045833983,0.33525054306291147,0.39774831989584963,0.44570455074844939,0.47585109773952472,0.48613352351115802,0.47585109773952478,0.44570455074844967,0.39774831989585002,0.33525054306291124,0.26247034045833972,0.1843675626146648,0.10626478477098977,3.3484582166418184E-2,0,0,0,0,4.968417086425454]
["Summa mot ytan",{"$f":"SUM(B96:B98)","v":0},{"$f":"SUM(C96:C98)","v":0},0,0.996182727969538,2.2284056931852465,3.9842953129182237,7.6809950948019861,11.420315797335242,14.749540572476288,17.350582435441275,19.000730350806666,19.565781339904014,19.000730350806666,17.350582435441279,14.749540572476292,11.42031579733524,7.6809950948019825,3.9842953129182277,2.2284056931852469,0.99618272796954699,0,0,0,0,{"$f":"SUM(B99:Y99)","v":174.38787730977293},{"$f":"Z99/Z$162","v":0.14570744162239921}]
[]
["Augusti","deklination",null,10.9]
["Kl",{"$f":"'Mot marken'!B103","v":1},{"$f":"'Mot marken'!C103","v":2},{"$f":"'Mot marken'!D103","v":3},{"$f":"'Mot marken'!E103","v":4},{"$f":"'Mot marken'!F103","v":5},{"$f":"'Mot marken'!G103","v":6},{"$f":"'Mot marken'!H103","v":7},{"$f":"'Mot marken'!I103","v":8},{"$f":"'Mot marken'!J103","v":9},{"$f":"'Mot marken'!K103","v":10},{"$f":"'Mot marken'!L103","v":11},{"$f":"'Mot marken'!M103","v":12},{"$f":"'Mot marken'!N103","v":13},{"$f":"'Mot marken'!O103","v":14},{"$f":"'Mot marken'!P103","v":15},{"$f":"'Mot marken'!Q103","v":16},{"$f":"'Mot marken'!R103","v":17},{"$f":"'Mot marken'!S103","v":18},{"$f":"'Mot marken'!T103","v":19},{"$f":"'Mot marken'!U103","v":20},{"$f":"'Mot marken'!V103","v":21},{"$f":"'Mot marken'!W103","v":22},{"$f":"'Mot marken'!X103","v":23},{"$f":"'Mot marken'!Y103","v":24}]
["solhöjd",{"$f":"IF('Mot marken'!B104<0,0,'Mot marken'!B104)","v":0},{"$f":"IF('Mot marken'!C104<0,0,'Mot marken'!C104)","v":0},{"$f":"IF('Mot marken'!D104<0,0,'Mot marken'!D104)","v":0},{"$f":"IF('Mot marken'!E104<0,0,'Mot marken'!E104)","v":0},{"$f":"IF('Mot marken'!F104<0,0,'Mot marken'!F104)","v":1.898714370648481},{"$f":"IF('Mot marken'!G104<0,0,'Mot marken'!G104)","v":9.362709526604819},{"$f":"IF('Mot marken'!H104<0,0,'Mot marken'!H104)","v":16.99180362973674},{"$f":"IF('Mot marken'!I104<0,0,'Mot marken'!I104)","v":24.390742426483413},{"$f":"IF('Mot marken'!J104<0,0,'Mot marken'!J104)","v":31.106063294891477},{"$f":"IF('Mot marken'!K104<0,0,'Mot marken'!K104)","v":36.596095571113672},{"$f":"IF('Mot marken'!L104<0,0,'Mot marken'!L104)","v":40.253831197620123},{"$f":"IF('Mot marken'!M104<0,0,'Mot marken'!M104)","v":41.54673500000002},{"$f":"IF('Mot marken'!N104<0,0,'Mot marken'!N104)","v":40.25383119762013},{"$f":"IF('Mot marken'!O104<0,0,'Mot marken'!O104)","v":36.596095571113686},{"$f":"IF('Mot marken'!P104<0,0,'Mot marken'!P104)","v":31.106063294891509},{"$f":"IF('Mot marken'!Q104<0,0,'Mot marken'!Q104)","v":24.390742426483396},{"$f":"IF('Mot marken'!R104<0,0,'Mot marken'!R104)","v":16.991803629736726},{"$f":"IF('Mot marken'!S104<0,0,'Mot marken'!S104)","v":9.3627095266048332},{"$f":"IF('Mot marken'!T104<0,0,'Mot marken'!T104)","v":1.8987143706484935},{"$f":"IF('Mot marken'!U104<0,0,'Mot marken'!U104)","v":0},{"$f":"IF('Mot marken'!V104<0,0,'Mot marken'!V104)","v":0},{"$f":"IF('Mot marken'!W104<0,0,'Mot marken'!W104)","v":0},{"$f":"IF('Mot marken'!X104<0,0,'Mot marken'!X104)","v":0},{"$f":"IF('Mot marken'!Y104<0,0,'Mot marken'!Y104)","v":0}]
["azimut",{"$f":"'Mot marken'!B105","v":-164.43493665761847},{"$f":"'Mot marken'!C105","v":-149.33371070764619},{"$f":"'Mot marken'!D105","v":-134.97556086906044},{"$f":"'Mot marken'!E105","v":-121.38554696778294},{"$f":"'Mot marken'!F105","v":-108.3737854295355},{"$f":"'Mot marken'!G105","v":-95.60625591273444},{"$f":"'Mot marken'!H105","v":-82.655077034112836},{"$f":"'Mot marken'!I105","v":-69.025020456195904},{"$f":"'Mot marken'!J105","v":-54.189333923916855},{"$f":"'Mot marken'!K105","v":-37.7008944590021},{"$f":"'Mot marken'!L105","v":-19.451569208746974},{"$f":"'Mot marken'!M105","v":0},{"$f":"'Mot marken'!N105","v":19.451569208746978},{"$f":"'Mot marken'!O105","v":37.7008944590021},{"$f":"'Mot marken'!P105","v":54.189333923916898},{"$f":"'Mot marken'!Q105","v":69.025020456195904},{"$f":"'Mot marken'!R105","v":82.655077034112836},{"$f":"'Mot marken'!S105","v":95.606255912734383},{"$f":"'Mot marken'!T105","v":108.3737854295355},{"$f":"'Mot marken'!U105","v":121.38554696778294},{"$f":"'Mot marken'!V105","v":134.97556086906044},{"$f":"'Mot marken'!W105","v":149.33371070764619},{"$f":"'Mot marken'!X105","v":164.43493665761847},{"$f":"'Mot marken'!Y105","v":180},"Summa"]
["Uppmätt IDN förd",{"$f":"'Mot marken'!B108","v":0},{"$f":"'Mot marken'!C108","v":0},{"$f":"'Mot marken'!D108","v":0},{"$f":"'Mot marken'!E108","v":0},{"$f":"'Mot marken'!F108","v":0.31475900562780579},{"$f":"'Mot marken'!G108","v":6.9903547464984763},{"$f":"'Mot marken'!H108","v":9.9349091387605899},{"$f":"'Mot marken'!I108","v":11.303353688175919},{"$f":"'Mot marken'!J108","v":12.034558424684301},{"$f":"'Mot marken'!K108","v":12.44226661812742},{"$f":"'Mot marken'!L108","v":12.652364704890164},{"$f":"'Mot marken'!M108","v":12.717487346470632},{"$f":"'Mot marken'!N108","v":12.652364704890164},{"$f":"'Mot marken'!O108","v":12.44226661812742},{"$f":"'Mot marken'!P108","v":12.034558424684304},{"$f":"'Mot marken'!Q108","v":11.303353688175918},{"$f":"'Mot marken'!R108","v":9.9349091387605863},{"$f":"'Mot marken'!S108","v":6.9903547464984834},{"$f":"'Mot marken'!T108","v":0.31475900562781373},{"$f":"'Mot marken'!U108","v":0},{"$f":"'Mot marken'!V108","v":0},{"$f":"'Mot marken'!W108","v":0},{"$f":"'Mot marken'!X108","v":0},{"$f":"'Mot marken'!Y108","v":0},{"$f":"SUM(B105:Y105)","v":144.06262000000001}]
["Global IDH + IdH förd",{"$f":"'Mot marken'!B112","v":0},{"$f":"'Mot marken'!C112","v":0},{"$f":"'Mot marken'!D112","v":0},{"$f":"'Mot marken'!E112","v":0},{"$f":"'Mot marken'!F112","v":0.73097799040347999},{"$f":"'Mot marken'!G112","v":3.5891463217203396},{"$f":"'Mot marken'!H112","v":6.447314653037207},{"$f":"'Mot marken'!I112","v":9.1107035359213207},{"$f":"'Mot marken'!J112","v":11.397807419462366},{"$f":"'Mot marken'!K112","v":13.152763953614903},{"$f":"'Mot marken'!L112","v":14.255975750779228},{"$f":"'Mot marken'!M112","v":14.632260750122294},{"$f":"'Mot marken'!N112","v":14.25597575077923},{"$f":"'Mot marken'!O112","v":13.152763953614906},{"$f":"'Mot marken'!P112","v":11.397807419462374},{"$f":"'Mot marken'!Q112","v":9.1107035359213118},{"$f":"'Mot marken'!R112","v":6.4473146530372034},{"$f":"'Mot marken'!S112","v":3.5891463217203445},{"$f":"'Mot marken'!T112","v":0.73097799040348477},{"$f":"'Mot marken'!U112","v":0},{"$f":"'Mot marken'!V112","v":0},{"$f":"'Mot marken'!W112","v":0},{"$f":"'Mot marken'!X112","v":0},{"$f":"'Mot marken'!Y112","v":0},{"$f":"SUM(B106:Y106)","v":132.00164000000001}]
["Diffusstrål IdH",{"$f":"'Mot marken'!B113","v":0},{"$f":"'Mot marken'!C113","v":0},{"$f":"'Mot marken'!D113","v":0},{"$f":"'Mot marken'!E113","v":0},{"$f":"'Mot marken'!F113","v":0.7205491582511333},{"$f":"'Mot marken'!G113","v":2.4519286696111715},{"$f":"'Mot marken'!H113","v":3.5439874858089229},{"$f":"'Mot marken'!I113","v":4.4429013352589379},{"$f":"'Mot marken'!J113","v":5.1804664302366055},{"$f":"'Mot marken'!K113","v":5.7350558050332321},{"$f":"'Mot marken'!L113","v":6.0803338196524752},{"$f":"'Mot marken'!M113","v":6.1976322618480566},{"$f":"'Mot marken'!N113","v":6.0803338196524752},{"$f":"'Mot marken'!O113","v":5.7350558050332348},{"$f":"'Mot marken'!P113","v":5.1804664302366072},{"$f":"'Mot marken'!Q113","v":4.4429013352589326},{"$f":"'Mot marken'!R113","v":3.5439874858089224},{"$f":"'Mot marken'!S113","v":2.4519286696111737},{"$f":"'Mot marken'!T113","v":0.72054915825113774},{"$f":"'Mot marken'!U113","v":0},{"$f":"'Mot marken'!V113","v":0},{"$f":"'Mot marken'!W113","v":0},{"$f":"'Mot marken'!X113","v":0},{"$f":"'Mot marken'!Y113","v":0},62.508077669553003]
["Direkt mot ytan",{"$f":"IF(B103<$L$10,0,IF(AND(B104>$L8,B104<$M8,B103<$L9),0,IF(SIN(B103*PI()/180)*(COS($C$7*PI()/180))+COS(B103*PI()/180)*SIN($C$7*PI()/180)*(COS((B104-($C$8-180))*PI()/180))<0,0,B105*(SIN(B103*PI()/180)*(COS($C$7*PI()/180))+COS(B103*PI()/180)*SIN($C$7*PI()/180)*(COS((B104-($C$8-180))*PI()/180))))))","v":0},0,0,0,0,0.3276848548063539,2.9118545566598795,5.9063469167245888,8.6594993959688189,10.833894847138721,{"$f":"IF(L103<$L$10,0,IF(AND(L104>$L8,L104<$M8,L103<$L9),0,IF(SIN(L103*PI()/180)*(COS($C$7*PI()/180))+COS(L103*PI()/180)*SIN($C$7*PI()/180)*(COS((L104-($C$8-180))*PI()/180))<0,0,L105*(SIN(L103*PI()/180)*(COS($C$7*PI()/180))+COS(L103*PI()/180)*SIN($C$7*PI()/180)*(COS((L104-($C$8-180))*PI()/180))))))","v":12.21926469251877},{"$f":"IF(M103<$L$10,0,IF(AND(M104>$L8,M104<$M8,M103<$L9),0,IF(SIN(M103*PI()/180)*(COS($C$7*PI()/180))+COS(M103*PI()/180)*SIN($C$7*PI()/180)*(COS((M104-($C$8-180))*PI()/180))<0,0,M105*(SIN(M103*PI()/180)*(COS($C$7*PI()/180))+COS(M103*PI()/180)*SIN($C$7*PI()/180)*(COS((M104-($C$8-180))*PI()/180))))))","v":12.694395726773978},12.21926469251877,10.833894847138723,8.6594993959688189,5.906346916724587,2.9118545566598764,0.32768485480635967,0,0,0,0,0,0,{"$f":"SUM(B108:Y108)","v":94.41148625440826},null,"Aug"]
["Diffus mot ytan",{"$f":"(B107)*(2+(COS($C$7*PI()/180)))/3","v":0},{"$f":"(C107)*(2+(COS($C$7*PI()/180)))/3","v":0},0,0,0.65020117082663387,2.2125442428300373,3.1979841850911992,4.0091361109407453,4.6746919343342599,5.1751361534295794,5.486704305019706,5.5925507744497978,5.486704305019706,5.1751361534295812,4.6746919343342617,4.0091361109407408,3.1979841850911992,2.2125442428300395,0.65020117082663786,0,0,0,0,0,{"$f":"SUM(B109:Y109)","v":56.405346979394139}]
["Markrefl. mot ytan",{"$f":"$F$7*B106*(1-COS($C$7*PI()/180))/2","v":0},{"$f":"$F$7*C106*(1-COS($C$7*PI()/180))/2","v":0},0,0,2.1409849649106423E-2,0.10512366189611334,0.18883747414312049,0.26684632842910982,0.33383405025021828,0.38523553706678193,0.41754786249722525,0.4285689949621061,0.41754786249722531,0.3852355370667821,0.33383405025021851,0.26684632842910955,0.18883747414312038,0.10512366189611348,2.1409849649106562E-2,0,{"$f":"$F$7*V106*(1-COS($C$7*PI()/180))/2","v":0},0,0,0,3.8662385228254568]
["Summa mot ytan",{"$f":"SUM(B108:B110)","v":0},{"$f":"SUM(C108:C110)","v":0},0,0,0.67161102047574028,2.6453527595325044,6.2986762158941989,10.182329356094446,13.668025380553296,16.394266537635083,18.123516860035704,18.71551549618588,18.123516860035704,16.394266537635087,13.668025380553299,10.182329356094437,6.2986762158941962,2.6453527595325124,0.67161102047574439,0,0,0,0,0,{"$f":"SUM(B111:Y111)","v":154.68307175662784},0.12924335679547347]
[]
["September","deklination",null,0]
["Kl",{"$f":"'Mot marken'!B116","v":1},{"$f":"'Mot marken'!C116","v":2},{"$f":"'Mot marken'!D116","v":3},{"$f":"'Mot marken'!E116","v":4},{"$f":"'Mot marken'!F116","v":5},{"$f":"'Mot marken'!G116","v":6},{"$f":"'Mot marken'!H116","v":7},{"$f":"'Mot marken'!I116","v":8},{"$f":"'Mot marken'!J116","v":9},{"$f":"'Mot marken'!K116","v":10},{"$f":"'Mot marken'!L116","v":11},{"$f":"'Mot marken'!M116","v":12},{"$f":"'Mot marken'!N116","v":13},{"$f":"'Mot marken'!O116","v":14},{"$f":"'Mot marken'!P116","v":15},{"$f":"'Mot marken'!Q116","v":16},{"$f":"'Mot marken'!R116","v":17},{"$f":"'Mot marken'!S116","v":18},{"$f":"'Mot marken'!T116","v":19},{"$f":"'Mot marken'!U116","v":20},{"$f":"'Mot marken'!V116","v":21},{"$f":"'Mot marken'!W116","v":22},{"$f":"'Mot marken'!X116","v":23},{"$f":"'Mot marken'!Y116","v":24}]
["solhöjd",{"$f":"IF('Mot marken'!B117<0,0,'Mot marken'!B117)","v":0},{"$f":"IF('Mot marken'!C117<0,0,'Mot marken'!C117)","v":0},{"$f":"IF('Mot marken'!D117<0,0,'Mot marken'!D117)","v":0},{"$f":"IF('Mot marken'!E117<0,0,'Mot marken'!E117)","v":0},{"$f":"IF('Mot marken'!F117<0,0,'Mot marken'!F117)","v":0},{"$f":"IF('Mot marken'!G117<0,0,'Mot marken'!G117)","v":0},{"$f":"IF('Mot marken'!H117<0,0,'Mot marken'!H117)","v":7.5812080846530563},{"$f":"IF('Mot marken'!I117<0,0,'Mot marken'!I117)","v":14.765981014739737},{"$f":"IF('Mot marken'!J117<0,0,'Mot marken'!J117)","v":21.12740278981671},{"$f":"IF('Mot marken'!K117<0,0,'Mot marken'!K117)","v":26.196476812473009},{"$f":"IF('Mot marken'!L117<0,0,'Mot marken'!L117)","v":29.496754156026245},{"$f":"IF('Mot marken'!M117<0,0,'Mot marken'!M117)","v":30.64673500000001},{"$f":"IF('Mot marken'!N117<0,0,'Mot marken'!N117)","v":29.496754156026245},{"$f":"IF('Mot marken'!O117<0,0,'Mot marken'!O117)","v":26.196476812473026},{"$f":"IF('Mot marken'!P117<0,0,'Mot marken'!P117)","v":21.127402789816745},{"$f":"IF('Mot marken'!Q117<0,0,'Mot marken'!Q117)","v":14.765981014739721},{"$f":"IF('Mot marken'!R117<0,0,'Mot marken'!R117)","v":7.5812080846530465},{"$f":"IF('Mot marken'!S117<0,0,'Mot marken'!S117)","v":8.9454648724253859E-15},{"$f":"IF('Mot marken'!T117<0,0,'Mot marken'!T117)","v":0},{"$f":"IF('Mot marken'!U117<0,0,'Mot marken'!U117)","v":0},{"$f":"IF('Mot marken'!V117<0,0,'Mot marken'!V117)","v":0},{"$f":"IF('Mot marken'!W117<0,0,'Mot marken'!W117)","v":0},{"$f":"IF('Mot marken'!X117<0,0,'Mot marken'!X117)","v":0},{"$f":"IF('Mot marken'!Y117<0,0,'Mot marken'!Y117)","v":0}]
["azimut",{"$f":"'Mot marken'!B118","v":-162.70076983452199},{"$f":"'Mot marken'!C118","v":-146.13512059411954},{"$f":"'Mot marken'!D118","v":-130.70628382281495},{"$f":"'Mot marken'!E118","v":-116.41403889135285},{"$f":"'Mot marken'!F118","v":-102.98126481840468},{"$f":"'Mot marken'!G118","v":-90},{"$f":"'Mot marken'!H118","v":-77.018735181595318},{"$f":"'Mot marken'!I118","v":-63.585961108647133},{"$f":"'Mot marken'!J118","v":-49.293716177185026},{"$f":"'Mot marken'!K118","v":-33.864879405880451},{"$f":"'Mot marken'!L118","v":-17.299230165478001},{"$f":"'Mot marken'!M118","v":0},{"$f":"'Mot marken'!N118","v":17.299230165478001},{"$f":"'Mot marken'!O118","v":33.864879405880451},{"$f":"'Mot marken'!P118","v":49.293716177185033},{"$f":"'Mot marken'!Q118","v":63.585961108647126},{"$f":"'Mot marken'!R118","v":77.018735181595318},{"$f":"'Mot marken'!S118","v":90},{"$f":"'Mot marken'!T118","v":102.98126481840468},{"$f":"'Mot marken'!U118","v":116.41403889135287},{"$f":"'Mot marken'!V118","v":130.70628382281495},{"$f":"'Mot marken'!W118","v":146.13512059411954},{"$f":"'Mot marken'!X118","v":162.70076983452199},{"$f":"'Mot marken'!Y118","v":180},"Summa"]
["Uppmätt IDN förd",{"$f":"'Mot marken'!B121","v":0},{"$f":"'Mot marken'!C121","v":0},{"$f":"'Mot marken'!D121","v":0},{"$f":"'Mot marken'!E121","v":0},{"$f":"'Mot marken'!F121","v":0},{"$f":"'Mot marken'!G121","v":0},{"$f":"'Mot marken'!H121","v":5.5144037344798171},{"$f":"'Mot marken'!I121","v":8.8375368199040096},{"$f":"'Mot marken'!J121","v":10.249739739107067},{"$f":"'Mot marken'!K121","v":10.945483387192271},{"$f":"'Mot marken'!L121","v":11.281333335628855},{"$f":"'Mot marken'!M121","v":11.382495967375977},{"$f":"'Mot marken'!N121","v":11.281333335628855},{"$f":"'Mot marken'!O121","v":10.945483387192274},{"$f":"'Mot marken'!P121","v":10.249739739107074},{"$f":"'Mot marken'!Q121","v":8.8375368199040061},{"$f":"'Mot marken'!R121","v":5.5144037344798091},{"$f":"'Mot marken'!S121","v":0},{"$f":"'Mot marken'!T121","v":0},{"$f":"'Mot marken'!U121","v":0},{"$f":"'Mot marken'!V121","v":0},{"$f":"'Mot marken'!W121","v":0},{"$f":"'Mot marken'!X121","v":0},{"$f":"'Mot marken'!Y121","v":0},{"$f":"SUM(B117:Y117)","v":105.03949}]
["Global IDH + IdH förd",{"$f":"'Mot marken'!B125","v":0},{"$f":"'Mot marken'!C125","v":0},{"$f":"'Mot marken'!D125","v":0},{"$f":"'Mot marken'!E125","v":0},{"$f":"'Mot marken'!F125","v":0},{"$f":"'Mot marken'!G125","v":0},{"$f":"'Mot marken'!H125","v":2.8185396639608995},{"$f":"'Mot marken'!I125","v":5.4450005076798833},{"$f":"'Mot marken'!J125","v":7.7003935650892741},{"$f":"'Mot marken'!K125","v":9.4310175265398826},{"$f":"'Mot marken'!L125","v":10.518933229050173},{"$f":"'Mot marken'!M125","v":10.890001015359763},{"$f":"'Mot marken'!N125","v":10.518933229050173},{"$f":"'Mot marken'!O125","v":9.4310175265398897},{"$f":"'Mot marken'!P125","v":7.7003935650892865},{"$f":"'Mot marken'!Q125","v":5.4450005076798771},{"$f":"'Mot marken'!R125","v":2.8185396639608955},{"$f":"'Mot marken'!S125","v":3.3354669794803291E-15},{"$f":"'Mot marken'!T125","v":0},{"$f":"'Mot marken'!U125","v":0},{"$f":"'Mot marken'!V125","v":0},{"$f":"'Mot marken'!W125","v":0},{"$f":"'Mot marken'!X125","v":0},{"$f":"'Mot marken'!Y125","v":0},{"$f":"SUM(B118:Y118)","v":82.717769999999987}]
["Diffusstrål IdH",{"$f":"'Mot marken'!B126","v":0},{"$f":"'Mot marken'!C126","v":0},{"$f":"'Mot marken'!D126","v":0},{"$f":"'Mot marken'!E126","v":0},{"$f":"'Mot marken'!F126","v":0},{"$f":"'Mot marken'!G126","v":0},{"$f":"'Mot marken'!H126","v":2.0910173016000391},{"$f":"'Mot marken'!I126","v":3.1925627570877326},{"$f":"'Mot marken'!J126","v":4.005946935929682},{"$f":"'Mot marken'!K126","v":4.5991264593770955},{"$f":"'Mot marken'!L126","v":4.9642951541177665},{"$f":"'Mot marken'!M126","v":5.0878495481913264},{"$f":"'Mot marken'!N126","v":4.9642951541177665},{"$f":"'Mot marken'!O126","v":4.5991264593770982},{"$f":"'Mot marken'!P126","v":4.0059469359296855},{"$f":"'Mot marken'!Q126","v":3.19256275708773},{"$f":"'Mot marken'!R126","v":2.0910173016000373},{"$f":"'Mot marken'!S126","v":3.3354669794803291E-15},{"$f":"'Mot marken'!T126","v":0},{"$f":"'Mot marken'!U126","v":0},{"$f":"'Mot marken'!V126","v":0},{"$f":"'Mot marken'!W126","v":0},{"$f":"'Mot marken'!X126","v":0},{"$f":"'Mot marken'!Y126","v":0},42.793746764415964]
["Direkt mot ytan",{"$f":"IF(B115<$L$10,0,IF(AND(B116>$L8,B116<$M8,B115<$L9),0,IF(SIN(B115*PI()/180)*(COS($C$7*PI()/180))+COS(B115*PI()/180)*SIN($C$7*PI()/180)*(COS((B116-($C$8-180))*PI()/180))<0,0,B117*(SIN(B115*PI()/180)*(COS($C$7*PI()/180))+COS(B115*PI()/180)*SIN($C$7*PI()/180)*(COS((B116-($C$8-180))*PI()/180))))))","v":0},0,0,0,0,0,1.3826826248865876,4.2808396037146323,7.0214297552767757,9.1831841460247237,{"$f":"IF(L115<$L$10,0,IF(AND(L116>$L8,L116<$M8,L115<$L9),0,IF(SIN(L115*PI()/180)*(COS($C$7*PI()/180))+COS(L115*PI()/180)*SIN($C$7*PI()/180)*(COS((L116-($C$8-180))*PI()/180))<0,0,L117*(SIN(L115*PI()/180)*(COS($C$7*PI()/180))+COS(L115*PI()/180)*SIN($C$7*PI()/180)*(COS((L116-($C$8-180))*PI()/180))))))","v":10.556791036387418},{"$f":"IF(M115<$L$10,0,IF(AND(M116>$L8,M116<$M8,M115<$L9),0,IF(SIN(M115*PI()/180)*(COS($C$7*PI()/180))+COS(M115*PI()/180)*SIN($C$7*PI()/180)*(COS((M116-($C$8-180))*PI()/180))<0,0,M117*(SIN(M115*PI()/180)*(COS($C$7*PI()/180))+COS(M115*PI()/180)*SIN($C$7*PI()/180)*(COS((M116-($C$8-180))*PI()/180))))))","v":11.027199211554613},10.556791036387418,9.1831841460247272,7.0214297552767828,4.2808396037146306,1.3826826248865849,0,0,0,0,0,0,0,{"$f":"SUM(B120:Y120)","v":75.877053544134881},null,"Sep"]
["Diffus mot ytan",{"$f":"(B119)*(2+(COS($C$7*PI()/180)))/3","v":0},{"$f":"(C119)*(2+(COS($C$7*PI()/180)))/3","v":0},0,0,0,0,1.8868690389132874,2.8808694296919408,3.6148420384429047,4.150108808571404,4.4796256918412407,4.5911173378552173,4.4796256918412407,4.1501088085714057,3.6148420384429074,2.8808694296919382,1.8868690389132858,3.0098217595250033E-15,0,0,0,0,0,0,38.615747352776779]
["Markrefl. mot ytan",{"$f":"$F$7*B118*(1-COS($C$7*PI()/180))/2","v":0},{"$f":"$F$7*C118*(1-COS($C$7*PI()/180))/2","v":0},0,0,0,0,8.2553115453089437E-2,0.15948037251352437,0.22553930574093939,0.27622810800343511,0.3080924211940288,0.31896074502704863,0.3080924211940288,0.27622810800343528,0.22553930574093978,0.15948037251352418,8.2553115453089326E-2,9.7693565986597731E-17,0,0,0,0,0,0,2.4227473908370829]
["Summa mot ytan",{"$f":"SUM(B120:B122)","v":0},{"$f":"SUM(C120:C122)","v":0},0,0,0,0,3.3521047792529646,7.3211894059200979,10.861811099460621,13.609521062599564,15.344509149422688,15.937277294436878,15.344509149422688,13.609521062599567,10.861811099460629,7.3211894059200926,3.3521047792529601,3.1075153255116013E-15,0,0,0,0,0,0,116.91554828774875,9.7687211345700894E-2]
[]
["Oktober","deklination",null,-10.9]
["Kl",{"$f":"'Mot marken'!B129","v":1},{"$f":"'Mot marken'!C129","v":2},{"$f":"'Mot marken'!D129","v":3},{"$f":"'Mot marken'!E129","v":4},{"$f":"'Mot marken'!F129","v":5},{"$f":"'Mot marken'!G129","v":6},{"$f":"'Mot marken'!H129","v":7},{"$f":"'Mot marken'!I129","v":8},{"$f":"'Mot marken'!J129","v":9},{"$f":"'Mot marken'!K129","v":10},{"$f":"'Mot marken'!L129","v":11},{"$f":"'Mot marken'!M129","v":12},{"$f":"'Mot marken'!N129","v":13},{"$f":"'Mot marken'!O129","v":14},{"$f":"'Mot marken'!P129","v":15},{"$f":"'Mot marken'!Q129","v":16},{"$f":"'Mot marken'!R129","v":17},{"$f":"'Mot marken'!S129","v":18},{"$f":"'Mot marken'!T129","v":19},{"$f":"'Mot marken'!U129","v":20},{"$f":"'Mot marken'!V129","v":21},{"$f":"'Mot marken'!W129","v":22},{"$f":"'Mot marken'!X129","v":23},{"$f":"'Mot marken'!Y129","v":24}]
["solhöjd",{"$f":"IF('Mot marken'!B130<0,0,'Mot marken'!B130)","v":0},{"$f":"IF('Mot marken'!C130<0,0,'Mot marken'!C130)","v":0},{"$f":"IF('Mot marken'!D130<0,0,'Mot marken'!D130)","v":0},{"$f":"IF('Mot marken'!E130<0,0,'Mot marken'!E130)","v":0},{"$f":"IF('Mot marken'!F130<0,0,'Mot marken'!F130)","v":0},{"$f":"IF('Mot marken'!G130<0,0,'Mot marken'!G130)","v":0},{"$f":"IF('Mot marken'!H130<0,0,'Mot marken'!H130)","v":0},{"$f":"IF('Mot marken'!I130<0,0,'Mot marken'!I130)","v":5.0249553163656548},{"$f":"IF('Mot marken'!J130<0,0,'Mot marken'!J130)","v":11.02610885897133},{"$f":"IF('Mot marken'!K130<0,0,'Mot marken'!K130)","v":15.712026703287284},{"$f":"IF('Mot marken'!L130<0,0,'Mot marken'!L130)","v":18.711757746754955},{"$f":"IF('Mot marken'!M130<0,0,'Mot marken'!M130)","v":19.746735000000008},{"$f":"IF('Mot marken'!N130<0,0,'Mot marken'!N130)","v":18.711757746754959},{"$f":"IF('Mot marken'!O130<0,0,'Mot marken'!O130)","v":15.712026703287302},{"$f":"IF('Mot marken'!P130<0,0,'Mot marken'!P130)","v":11.026108858971359},{"$f":"IF('Mot marken'!Q130<0,0,'Mot marken'!Q130)","v":5.0249553163656415},{"$f":"IF('Mot marken'!R130<0,0,'Mot marken'!R130)","v":0},{"$f":"IF('Mot marken'!S130<0,0,'Mot marken'!S130)","v":0},{"$f":"IF('Mot marken'!T130<0,0,'Mot marken'!T130)","v":0},{"$f":"IF('Mot marken'!U130<0,0,'Mot marken'!U130)","v":0},{"$f":"IF('Mot marken'!V130<0,0,'Mot marken'!V130)","v":0},{"$f":"IF('Mot marken'!W130<0,0,'Mot marken'!W130)","v":0},{"$f":"IF('Mot marken'!X130<0,0,'Mot marken'!X130)","v":0},{"$f":"IF('Mot marken'!Y130<0,0,'Mot marken'!Y130)","v":0}]
["azimut",{"$f":"'Mot marken'!B131","v":-160.548430791253},{"$f":"'Mot marken'!C131","v":-142.29910554099791},{"$f":"'Mot marken'!D131","v":-125.81066607608309},{"$f":"'Mot marken'!E131","v":-110.97497954380407},{"$f":"'Mot marken'!F131","v":-97.344922965887164},{"$f":"'Mot marken'!G131","v":-84.39374408726556},{"$f":"'Mot marken'!H131","v":-71.626214570464498},{"$f":"'Mot marken'!I131","v":-58.614453032217043},{"$f":"'Mot marken'!J131","v":-45.024439130939548},{"$f":"'Mot marken'!K131","v":-30.666289292353802},{"$f":"'Mot marken'!L131","v":-15.565063342381514},{"$f":"'Mot marken'!M131","v":0},{"$f":"'Mot marken'!N131","v":15.565063342381514},{"$f":"'Mot marken'!O131","v":30.666289292353802},{"$f":"'Mot marken'!P131","v":45.024439130939548},{"$f":"'Mot marken'!Q131","v":58.614453032217043},{"$f":"'Mot marken'!R131","v":71.626214570464498},{"$f":"'Mot marken'!S131","v":84.39374408726556},{"$f":"'Mot marken'!T131","v":97.344922965887207},{"$f":"'Mot marken'!U131","v":110.9749795438041},{"$f":"'Mot marken'!V131","v":125.81066607608311},{"$f":"'Mot marken'!W131","v":142.29910554099791},{"$f":"'Mot marken'!X131","v":160.548430791253},{"$f":"'Mot marken'!Y131","v":180},"Summa"]
["Uppmätt IDN förd",{"$f":"'Mot marken'!B134","v":0},{"$f":"'Mot marken'!C134","v":0},{"$f":"'Mot marken'!D134","v":0},{"$f":"'Mot marken'!E134","v":0},{"$f":"'Mot marken'!F134","v":0},{"$f":"'Mot marken'!G134","v":0},{"$f":"'Mot marken'!H134","v":0},{"$f":"'Mot marken'!I134","v":2.8383303308917629},{"$f":"'Mot marken'!J134","v":6.3060244412176019},{"$f":"'Mot marken'!K134","v":7.6877731385663575},{"$f":"'Mot marken'!L134","v":8.2803280665243957},{"$f":"'Mot marken'!M134","v":8.4501280455997616},{"$f":"'Mot marken'!N134","v":8.2803280665243957},{"$f":"'Mot marken'!O134","v":7.6877731385663619},{"$f":"'Mot marken'!P134","v":6.3060244412176134},{"$f":"'Mot marken'!Q134","v":2.8383303308917518},{"$f":"'Mot marken'!R134","v":0},{"$f":"'Mot marken'!S134","v":0},{"$f":"'Mot marken'!T134","v":0},{"$f":"'Mot marken'!U134","v":0},{"$f":"'Mot marken'!V134","v":0},{"$f":"'Mot marken'!W134","v":0},{"$f":"'Mot marken'!X134","v":0},{"$f":"'Mot marken'!Y134","v":0},{"$f":"SUM(B129:Y129)","v":58.67504000000001}]
["Global IDH + IdH förd",{"$f":"'Mot marken'!B138","v":0},{"$f":"'Mot marken'!C138","v":0},{"$f":"'Mot marken'!D138","v":0},{"$f":"'Mot marken'!E138","v":0},{"$f":"'Mot marken'!F138","v":0},{"$f":"'Mot marken'!G138","v":0},{"$f":"'Mot marken'!H138","v":0},{"$f":"'Mot marken'!I138","v":1.6349384142907126},{"$f":"'Mot marken'!J138","v":3.5699689045580389},{"$f":"'Mot marken'!K138","v":5.0547700223023204},{"$f":"'Mot marken'!L138","v":5.9881550250991467},{"$f":"'Mot marken'!M138","v":6.3065152674995577},{"$f":"'Mot marken'!N138","v":5.9881550250991467},{"$f":"'Mot marken'!O138","v":5.0547700223023257},{"$f":"'Mot marken'!P138","v":3.5699689045580483},{"$f":"'Mot marken'!Q138","v":1.6349384142907084},{"$f":"'Mot marken'!R138","v":0},{"$f":"'Mot marken'!S138","v":0},{"$f":"'Mot marken'!T138","v":0},{"$f":"'Mot marken'!U138","v":0},{"$f":"'Mot marken'!V138","v":0},{"$f":"'Mot marken'!W138","v":0},{"$f":"'Mot marken'!X138","v":0},{"$f":"'Mot marken'!Y138","v":0},38.802180000000007]
["Diffusstrål IdH",{"$f":"'Mot marken'!B139","v":0},{"$f":"'Mot marken'!C139","v":0},{"$f":"'Mot marken'!D139","v":0},{"$f":"'Mot marken'!E139","v":0},{"$f":"'Mot marken'!F139","v":0},{"$f":"'Mot marken'!G139","v":0},{"$f":"'Mot marken'!H139","v":0},{"$f":"'Mot marken'!I139","v":1.3863301122237688},{"$f":"'Mot marken'!J139","v":2.3639020723674982},{"$f":"'Mot marken'!K139","v":2.9729017264472142},{"$f":"'Mot marken'!L139","v":3.331764820137527},{"$f":"'Mot marken'!M139","v":3.4515289412603569},{"$f":"'Mot marken'!N139","v":3.331764820137527},{"$f":"'Mot marken'!O139","v":2.9729017264472155},{"$f":"'Mot marken'!P139","v":2.3639020723675017},{"$f":"'Mot marken'!Q139","v":1.3863301122237663},{"$f":"'Mot marken'!R139","v":0},{"$f":"'Mot marken'!S139","v":0},{"$f":"'Mot marken'!T139","v":0},{"$f":"'Mot marken'!U139","v":0},{"$f":"'Mot marken'!V139","v":0},{"$f":"'Mot marken'!W139","v":0},{"$f":"'Mot marken'!X139","v":0},{"$f":"'Mot marken'!Y139","v":0},23.561326403612377]
["Direkt mot ytan",{"$f":"IF(B127<$L$10,0,IF(AND(B128>$L8,B128<$M8,B127<$L9),0,IF(SIN(B127*PI()/180)*(COS($C$7*PI()/180))+COS(B127*PI()/180)*SIN($C$7*PI()/180)*(COS((B128-($C$8-180))*PI()/180))<0,0,B129*(SIN(B127*PI()/180)*(COS($C$7*PI()/180))+COS(B127*PI()/180)*SIN($C$7*PI()/180)*(COS((B128-($C$8-180))*PI()/180))))))","v":0},0,0,0,0,0,0,1.2170109384760124,3.9463057176810836,5.973244367890338,{"$f":"IF(L127<$L$10,0,IF(AND(L128>$L8,L128<$M8,L127<$L9),0,IF(SIN(L127*PI()/180)*(COS($C$7*PI()/180))+COS(L127*PI()/180)*SIN($C$7*PI()/180)*(COS((L128-($C$8-180))*PI()/180))<0,0,L129*(SIN(L127*PI()/180)*(COS($C$7*PI()/180))+COS(L127*PI()/180)*SIN($C$7*PI()/180)*(COS((L128-($C$8-180))*PI()/180))))))","v":7.2205770462971817},{"$f":"IF(M127<$L$10,0,IF(AND(M128>$L8,M128<$M8,M127<$L9),0,IF(SIN(M127*PI()/180)*(COS($C$7*PI()/180))+COS(M127*PI()/180)*SIN($C$7*PI()/180)*(COS((M128-($C$8-180))*PI()/180))<0,0,M129*(SIN(M127*PI()/180)*(COS($C$7*PI()/180))+COS(M127*PI()/180)*SIN($C$7*PI()/180)*(COS((M128-($C$8-180))*PI()/180))))))","v":7.6425563723031447},7.2205770462971817,5.9732443678903442,3.9463057176810925,1.2170109384760073,0,0,0,0,0,0,0,0,{"$f":"SUM(B132:Y132)","v":44.356832512992391},null,"Okt"]
["Diffus mot ytan",{"$f":"(B131)*(2+(COS($C$7*PI()/180)))/3","v":0},{"$f":"(C131)*(2+(COS($C$7*PI()/180)))/3","v":0},0,0,0,0,0,1.2509812159213574,2.1331117767223291,2.6826541411554827,3.0064810459710256,3.1145524674491791,3.0064810459710256,2.6826541411554836,2.1331117767223322,1.2509812159213551,0,0,0,0,0,0,0,0,21.261008826989574]
["Markrefl. mot ytan",{"$f":"$F$7*B130*(1-COS($C$7*PI()/180))/2","v":0},{"$f":"$F$7*C130*(1-COS($C$7*PI()/180))/2","v":0},0,0,0,0,0,4.7886237472336869E-2,0.10456196835199388,0.14805078621938733,0.1753890000055239,0.18471355561941266,0.1753890000055239,0.1480507862193875,0.10456196835199416,4.7886237472336744E-2,0,0,0,0,0,0,0,0,1.1364895397178969]
["Summa mot ytan",{"$f":"SUM(B132:B134)","v":0},{"$f":"SUM(C132:C134)","v":0},0,0,0,0,0,2.5158783918697067,6.1839794627554063,8.803949295265209,10.40244709227373,10.941822395371736,10.40244709227373,8.8039492952652161,6.1839794627554188,2.5158783918696987,0,0,0,0,0,0,0,0,66.754330879699864,5.5775681886524667E-2]
[]
["November","deklination",null,-19.899999999999999]
["Kl",{"$f":"'Mot marken'!B142","v":1},{"$f":"'Mot marken'!C142","v":2},{"$f":"'Mot marken'!D142","v":3},{"$f":"'Mot marken'!E142","v":4},{"$f":"'Mot marken'!F142","v":5},{"$f":"'Mot marken'!G142","v":6},{"$f":"'Mot marken'!H142","v":7},{"$f":"'Mot marken'!I142","v":8},{"$f":"'Mot marken'!J142","v":9},{"$f":"'Mot marken'!K142","v":10},{"$f":"'Mot marken'!L142","v":11},{"$f":"'Mot marken'!M142","v":12},{"$f":"'Mot marken'!N142","v":13},{"$f":"'Mot marken'!O142","v":14},{"$f":"'Mot marken'!P142","v":15},{"$f":"'Mot marken'!Q142","v":16},{"$f":"'Mot marken'!R142","v":17},{"$f":"'Mot marken'!S142","v":18},{"$f":"'Mot marken'!T142","v":19},{"$f":"'Mot marken'!U142","v":20},{"$f":"'Mot marken'!V142","v":21},{"$f":"'Mot marken'!W142","v":22},{"$f":"'Mot marken'!X142","v":23},{"$f":"'Mot marken'!Y142","v":24}]
["solhöjd",{"$f":"IF('Mot marken'!B143<0,0,'Mot marken'!B143)","v":0},{"$f":"IF('Mot marken'!C143<0,0,'Mot marken'!C143)","v":0},{"$f":"IF('Mot marken'!D143<0,0,'Mot marken'!D143)","v":0},{"$f":"IF('Mot marken'!E143<0,0,'Mot marken'!E143)","v":0},{"$f":"IF('Mot marken'!F143<0,0,'Mot marken'!F143)","v":0},{"$f":"IF('Mot marken'!G143<0,0,'Mot marken'!G143)","v":0},{"$f":"IF('Mot marken'!H143<0,0,'Mot marken'!H143)","v":0},{"$f":"IF('Mot marken'!I143<0,0,'Mot marken'!I143)","v":0},{"$f":"IF('Mot marken'!J143<0,0,'Mot marken'!J143)","v":2.641278984074086},{"$f":"IF('Mot marken'!K143<0,0,'Mot marken'!K143)","v":7.022163422718732},{"$f":"IF('Mot marken'!L143<0,0,'Mot marken'!L143)","v":9.7957327703534496},{"$f":"IF('Mot marken'!M143<0,0,'Mot marken'!M143)","v":10.746735000000012},{"$f":"IF('Mot marken'!N143<0,0,'Mot marken'!N143)","v":9.7957327703534514},{"$f":"IF('Mot marken'!O143<0,0,'Mot marken'!O143)","v":7.0221634227187497},{"$f":"IF('Mot marken'!P143<0,0,'Mot marken'!P143)","v":2.6412789840741113},{"$f":"IF('Mot marken'!Q143<0,0,'Mot marken'!Q143)","v":0},{"$f":"IF('Mot marken'!R143<0,0,'Mot marken'!R143)","v":0},{"$f":"IF('Mot marken'!S143<0,0,'Mot marken'!S143)","v":0},{"$f":"IF('Mot marken'!T143<0,0,'Mot marken'!T143)","v":0},{"$f":"IF('Mot marken'!U143<0,0,'Mot marken'!U143)","v":0},{"$f":"IF('Mot marken'!V143<0,0,'Mot marken'!V143)","v":0},{"$f":"IF('Mot marken'!W143<0,0,'Mot marken'!W143)","v":0},{"$f":"IF('Mot marken'!X143<0,0,'Mot marken'!X143)","v":0},{"$f":"IF('Mot marken'!Y143<0,0,'Mot marken'!Y143)","v":0}]
["azimut",{"$f":"'Mot marken'!B144","v":-158.18146280680716},{"$f":"'Mot marken'!C144","v":-138.26713973182521},{"$f":"'Mot marken'!D144","v":-120.93718492399935},{"$f":"'Mot marken'!E144","v":-105.83541512018189},{"$f":"'Mot marken'!F144","v":-92.261433351179505},{"$f":"'Mot marken'!G144","v":-79.545126017601021},{"$f":"'Mot marken'!H144","v":-67.141773170231858},{"$f":"'Mot marken'!I144","v":-54.633617905499761},{"$f":"'Mot marken'!J144","v":-41.727697866177074},{"$f":"'Mot marken'!K144","v":-28.274565045280941},{"$f":"'Mot marken'!L144","v":-14.297993919623277},{"$f":"'Mot marken'!M144","v":0},{"$f":"'Mot marken'!N144","v":14.297993919623277},{"$f":"'Mot marken'!O144","v":28.274565045280941},{"$f":"'Mot marken'!P144","v":41.727697866177074},{"$f":"'Mot marken'!Q144","v":54.633617905499783},{"$f":"'Mot marken'!R144","v":67.141773170231872},{"$f":"'Mot marken'!S144","v":79.545126017600978},{"$f":"'Mot marken'!T144","v":92.261433351179662},{"$f":"'Mot marken'!U144","v":105.83541512018199},{"$f":"'Mot marken'!V144","v":120.93718492399935},{"$f":"'Mot marken'!W144","v":138.26713973182518},{"$f":"'Mot marken'!X144","v":158.18146280680719},{"$f":"'Mot marken'!Y144","v":180},"Summa"]
["Uppmätt IDN förd",{"$f":"'Mot marken'!B147","v":0},{"$f":"'Mot marken'!C147","v":0},{"$f":"'Mot marken'!D147","v":0},{"$f":"'Mot marken'!E147","v":0},{"$f":"'Mot marken'!F147","v":0},{"$f":"'Mot marken'!G147","v":0},{"$f":"'Mot marken'!H147","v":0},{"$f":"'Mot marken'!I147","v":0},{"$f":"'Mot marken'!J147","v":0.67726423737433361},{"$f":"'Mot marken'!K147","v":3.8745735180715624},{"$f":"'Mot marken'!L147","v":5.2143037692411331},{"$f":"'Mot marken'!M147","v":5.5723369506259122},{"$f":"'Mot marken'!N147","v":5.2143037692411331},{"$f":"'Mot marken'!O147","v":3.8745735180715726},{"$f":"'Mot marken'!P147","v":0.67726423737435204},{"$f":"'Mot marken'!Q147","v":0},{"$f":"'Mot marken'!R147","v":0},{"$f":"'Mot marken'!S147","v":0},{"$f":"'Mot marken'!T147","v":0},{"$f":"'Mot marken'!U147","v":0},{"$f":"'Mot marken'!V147","v":0},{"$f":"'Mot marken'!W147","v":0},{"$f":"'Mot marken'!X147","v":0},{"$f":"'Mot marken'!Y147","v":0},{"$f":"SUM(B141:Y141)","v":25.104619999999997}]
["Global IDH + IdH förd",{"$f":"'Mot marken'!B151","v":0},{"$f":"'Mot marken'!C151","v":0},{"$f":"'Mot marken'!D151","v":0},{"$f":"'Mot marken'!E151","v":0},{"$f":"'Mot marken'!F151","v":0},{"$f":"'Mot marken'!G151","v":0},{"$f":"'Mot marken'!H151","v":0},{"$f":"'Mot marken'!I151","v":0},{"$f":"'Mot marken'!J151","v":0.64623893565159007},{"$f":"'Mot marken'!K151","v":1.7144144309826228},{"$f":"'Mot marken'!L151","v":2.385897618718726},{"$f":"'Mot marken'!M151","v":2.6149280292941133},{"$f":"'Mot marken'!N151","v":2.385897618718726},{"$f":"'Mot marken'!O151","v":1.7144144309826272},{"$f":"'Mot marken'!P151","v":0.64623893565159629},{"$f":"'Mot marken'!Q151","v":0},{"$f":"'Mot marken'!R151","v":0},{"$f":"'Mot marken'!S151","v":0},{"$f":"'Mot marken'!T151","v":0},{"$f":"'Mot marken'!U151","v":0},{"$f":"'Mot marken'!V151","v":0},{"$f":"'Mot marken'!W151","v":0},{"$f":"'Mot marken'!X151","v":0},{"$f":"'Mot marken'!Y151","v":0},12.108030000000001]
["Diffusstrål IdH",{"$f":"'Mot marken'!B152","v":0},{"$f":"'Mot marken'!C152","v":0},{"$f":"'Mot marken'!D152","v":0},{"$f":"'Mot marken'!E152","v":0},{"$f":"'Mot marken'!F152","v":0},{"$f":"'Mot marken'!G152","v":0},{"$f":"'Mot marken'!H152","v":0},{"$f":"'Mot marken'!I152","v":0},{"$f":"'Mot marken'!J152","v":0.61502877855125493},{"$f":"'Mot marken'!K152","v":1.2407351266709568},{"$f":"'Mot marken'!L152","v":1.4987562681046869},{"$f":"'Mot marken'!M152","v":1.5758652198776679},{"$f":"'Mot marken'!N152","v":1.4987562681046869},{"$f":"'Mot marken'!O152","v":1.2407351266709585},{"$f":"'Mot marken'!P152","v":0.61502877855126004},{"$f":"'Mot marken'!Q152","v":0},{"$f":"'Mot marken'!R152","v":0},{"$f":"'Mot marken'!S152","v":0},{"$f":"'Mot marken'!T152","v":0},{"$f":"'Mot marken'!U152","v":0},{"$f":"'Mot marken'!V152","v":0},{"$f":"'Mot marken'!W152","v":0},{"$f":"'Mot marken'!X152","v":0},{"$f":"'Mot marken'!Y152","v":0},8.2849055665314726]
["Direkt mot ytan",{"$f":"IF(B139<$L$10,0,IF(AND(B140>$L8,B140<$M8,B139<$L9),0,IF(SIN(B139*PI()/180)*(COS($C$7*PI()/180))+COS(B139*PI()/180)*SIN($C$7*PI()/180)*(COS((B140-($C$8-180))*PI()/180))<0,0,B141*(SIN(B139*PI()/180)*(COS($C$7*PI()/180))+COS(B139*PI()/180)*SIN($C$7*PI()/180)*(COS((B140-($C$8-180))*PI()/180))))))","v":0},0,0,0,0,0,0,0,0,2.7296958138343221,{"$f":"IF(L139<$L$10,0,IF(AND(L140>$L8,L140<$M8,L139<$L9),0,IF(SIN(L139*PI()/180)*(COS($C$7*PI()/180))+COS(L139*PI()/180)*SIN($C$7*PI()/180)*(COS((L140-($C$8-180))*PI()/180))<0,0,L141*(SIN(L139*PI()/180)*(COS($C$7*PI()/180))+COS(L139*PI()/180)*SIN($C$7*PI()/180)*(COS((L140-($C$8-180))*PI()/180))))))","v":4.1480736922953687},{"$f":"IF(M139<$L$10,0,IF(AND(M140>$L8,M140<$M8,M139<$L9),0,IF(SIN(M139*PI()/180)*(COS($C$7*PI()/180))+COS(M139*PI()/180)*SIN($C$7*PI()/180)*(COS((M140-($C$8-180))*PI()/180))<0,0,M141*(SIN(M139*PI()/180)*(COS($C$7*PI()/180))+COS(M139*PI()/180)*SIN($C$7*PI()/180)*(COS((M140-($C$8-180))*PI()/180))))))","v":4.6058578817278102},4.1480736922953687,2.7296958138343301,0,0,0,0,0,0,0,0,0,0,{"$f":"SUM(B144:Y144)","v":18.361396893987198},null,"Nov"]
["Diffus mot ytan",{"$f":"(B143)*(2+(COS($C$7*PI()/180)))/3","v":0},{"$f":"(C143)*(2+(COS($C$7*PI()/180)))/3","v":0},0,0,0,0,0,0,0.55498285901366051,1.1196008250224323,1.3524310855773471,1.4220118076556216,1.3524310855773471,1.1196008250224339,0.55498285901366518,0,0,0,0,0,0,0,0,0,{"$f":"SUM(B145:Y145)","v":7.476041346882508}]
["Markrefl. mot ytan",{"$f":"$F$8*B142*(1-COS($C$7*PI()/180))/2","v":0},{"$f":"$F$8*C142*(1-COS($C$7*PI()/180))/2","v":0},0,0,0,0,0,0,4.7319750496393441E-2,0.12553509026768347,0.17470330832646971,0.19147367186636766,0.17470330832646971,0.12553509026768381,4.7319750496393899E-2,0,0,0,0,0,0,0,0,0,0.88658997004746176]
["Summa mot ytan",{"$f":"SUM(B144:B146)","v":0},{"$f":"SUM(C144:C146)","v":0},0,0,0,0,0,0,0.60230260951005399,3.9748317291244377,5.6752080861991852,6.2193433612498001,5.6752080861991852,3.9748317291244475,0.60230260951005909,0,0,0,0,0,0,0,0,0,{"$f":"SUM(B147:Y147)","v":26.724028210917165},2.2328901759270072E-2]
[]
["December","deklination",null,-23.45]
["Kl",{"$f":"'Mot marken'!B155","v":1},{"$f":"'Mot marken'!C155","v":2},{"$f":"'Mot marken'!D155","v":3},{"$f":"'Mot marken'!E155","v":4},{"$f":"'Mot marken'!F155","v":5},{"$f":"'Mot marken'!G155","v":6},{"$f":"'Mot marken'!H155","v":7},{"$f":"'Mot marken'!I155","v":8},{"$f":"'Mot marken'!J155","v":9},{"$f":"'Mot marken'!K155","v":10},{"$f":"'Mot marken'!L155","v":11},{"$f":"'Mot marken'!M155","v":12},{"$f":"'Mot marken'!N155","v":13},{"$f":"'Mot marken'!O155","v":14},{"$f":"'Mot marken'!P155","v":15},{"$f":"'Mot marken'!Q155","v":16},{"$f":"'Mot marken'!R155","v":17},{"$f":"'Mot marken'!S155","v":18},{"$f":"'Mot marken'!T155","v":19},{"$f":"'Mot marken'!U155","v":20},{"$f":"'Mot marken'!V155","v":21},{"$f":"'Mot marken'!W155","v":22},{"$f":"'Mot marken'!X155","v":23},{"$f":"'Mot marken'!Y155","v":24}]
["solhöjd",{"$f":"IF('Mot marken'!B156<0,0,'Mot marken'!B156)","v":0},{"$f":"IF('Mot marken'!C156<0,0,'Mot marken'!C156)","v":0},{"$f":"IF('Mot marken'!D156<0,0,'Mot marken'!D156)","v":0},{"$f":"IF('Mot marken'!E156<0,0,'Mot marken'!E156)","v":0},{"$f":"IF('Mot marken'!F156<0,0,'Mot marken'!F156)","v":0},{"$f":"IF('Mot marken'!G156<0,0,'Mot marken'!G156)","v":0},{"$f":"IF('Mot marken'!H156<0,0,'Mot marken'!H156)","v":0},{"$f":"IF('Mot marken'!I156<0,0,'Mot marken'!I156)","v":0},{"$f":"IF('Mot marken'!J156<0,0,'Mot marken'!J156)","v":0},{"$f":"IF('Mot marken'!K156<0,0,'Mot marken'!K156)","v":3.5904683233140529},{"$f":"IF('Mot marken'!L156<0,0,'Mot marken'!L156)","v":6.2773957936667966},{"$f":"IF('Mot marken'!M156<0,0,'Mot marken'!M156)","v":7.1967350000000119},{"$f":"IF('Mot marken'!N156<0,0,'Mot marken'!N156)","v":6.2773957936667992},{"$f":"IF('Mot marken'!O156<0,0,'Mot marken'!O156)","v":3.5904683233140688},{"$f":"IF('Mot marken'!P156<0,0,'Mot marken'!P156)","v":0},{"$f":"IF('Mot marken'!Q156<0,0,'Mot marken'!Q156)","v":0},{"$f":"IF('Mot marken'!R156<0,0,'Mot marken'!R156)","v":0},{"$f":"IF('Mot marken'!S156<0,0,'Mot marken'!S156)","v":0},{"$f":"IF('Mot marken'!T156<0,0,'Mot marken'!T156)","v":0},{"$f":"IF('Mot marken'!U156<0,0,'Mot marken'!U156)","v":0},{"$f":"IF('Mot marken'!V156<0,0,'Mot marken'!V156)","v":0},{"$f":"IF('Mot marken'!W156<0,0,'Mot marken'!W156)","v":0},{"$f":"IF('Mot marken'!X156<0,0,'Mot marken'!X156)","v":0},{"$f":"IF('Mot marken'!Y156<0,0,'Mot marken'!Y156)","v":0}]
["azimut",{"$f":"'Mot marken'!B157","v":-157.00534475171332},{"$f":"'Mot marken'!C157","v":-136.33992893978177},{"$f":"'Mot marken'!D157","v":-118.70617717979059},{"$f":"'Mot marken'!E157","v":-103.57097662525939},{"$f":"'Mot marken'!F157","v":-90.092232753370993},{"$f":"'Mot marken'!G157","v":-77.531716236726936},{"$f":"'Mot marken'!H157","v":-65.324160142493739},{"$f":"'Mot marken'!I157","v":-53.055729699891067},{"$f":"'Mot marken'!J157","v":-40.44738984966002},{"$f":"'Mot marken'!K157","v":-27.361685197148589},{"$f":"'Mot marken'!L157","v":-13.820141888097904},{"$f":"'Mot marken'!M157","v":0},{"$f":"'Mot marken'!N157","v":13.820141888097904},{"$f":"'Mot marken'!O157","v":27.361685197148585},{"$f":"'Mot marken'!P157","v":40.44738984966002},{"$f":"'Mot marken'!Q157","v":53.055729699891067},{"$f":"'Mot marken'!R157","v":65.324160142493739},{"$f":"'Mot marken'!S157","v":77.531716236726922},{"$f":"'Mot marken'!T157","v":90.092232753370993},{"$f":"'Mot marken'!U157","v":103.57097662525949},{"$f":"'Mot marken'!V157","v":118.70617717979059},{"$f":"'Mot marken'!W157","v":136.33992893978174},{"$f":"'Mot marken'!X157","v":157.00534475171335},{"$f":"'Mot marken'!Y157","v":180},"Summa"]
["Uppmätt IDN förd",{"$f":"'Mot marken'!B160","v":0},{"$f":"'Mot marken'!C160","v":0},{"$f":"'Mot marken'!D160","v":0},{"$f":"'Mot marken'!E160","v":0},{"$f":"'Mot marken'!F160","v":0},{"$f":"'Mot marken'!G160","v":0},{"$f":"'Mot marken'!H160","v":0},{"$f":"'Mot marken'!I160","v":0},{"$f":"'Mot marken'!J160","v":0},{"$f":"'Mot marken'!K160","v":1.7832656548522499},{"$f":"'Mot marken'!L160","v":4.2997663483635069},{"$f":"'Mot marken'!M160","v":4.995925993568469},{"$f":"'Mot marken'!N160","v":4.2997663483635096},{"$f":"'Mot marken'!O160","v":1.7832656548522654},{"$f":"'Mot marken'!P160","v":0},{"$f":"'Mot marken'!Q160","v":0},{"$f":"'Mot marken'!R160","v":0},{"$f":"'Mot marken'!S160","v":0},{"$f":"'Mot marken'!T160","v":0},{"$f":"'Mot marken'!U160","v":0},{"$f":"'Mot marken'!V160","v":0},{"$f":"'Mot marken'!W160","v":0},{"$f":"'Mot marken'!X160","v":0},{"$f":"'Mot marken'!Y160","v":0},{"$f":"SUM(B153:Y153)","v":17.161989999999999}]
["Global IDH + IdH förd",{"$f":"'Mot marken'!B164","v":0},{"$f":"'Mot marken'!C164","v":0},{"$f":"'Mot marken'!D164","v":0},{"$f":"'Mot marken'!E164","v":0},{"$f":"'Mot marken'!F164","v":0},{"$f":"'Mot marken'!G164","v":0},{"$f":"'Mot marken'!H164","v":0},{"$f":"'Mot marken'!I164","v":0},{"$f":"'Mot marken'!J164","v":0},{"$f":"'Mot marken'!K164","v":0.82671903492302878},{"$f":"'Mot marken'!L164","v":1.4434489473764185},{"$f":"'Mot marken'!M164","v":1.6538040354011017},{"$f":"'Mot marken'!N164","v":1.4434489473764189},{"$f":"'Mot marken'!O164","v":0.82671903492303223},{"$f":"'Mot marken'!P164","v":0},{"$f":"'Mot marken'!Q164","v":0},{"$f":"'Mot marken'!R164","v":0},{"$f":"'Mot marken'!S164","v":0},{"$f":"'Mot marken'!T164","v":0},{"$f":"'Mot marken'!U164","v":0},{"$f":"'Mot marken'!V164","v":0},{"$f":"'Mot marken'!W164","v":0},{"$f":"'Mot marken'!X164","v":0},{"$f":"'Mot marken'!Y164","v":0},6.19414]
["Diffusstrål IdH",{"$f":"'Mot marken'!B165","v":0},{"$f":"'Mot marken'!C165","v":0},{"$f":"'Mot marken'!D165","v":0},{"$f":"'Mot marken'!E165","v":0},{"$f":"'Mot marken'!F165","v":0},{"$f":"'Mot marken'!G165","v":0},{"$f":"'Mot marken'!H165","v":0},{"$f":"'Mot marken'!I165","v":0},{"$f":"'Mot marken'!J165","v":0},{"$f":"'Mot marken'!K165","v":0.71504293669162045},{"$f":"'Mot marken'!L165","v":0.9733031761912222},{"$f":"'Mot marken'!M165","v":1.027930924950736},{"$f":"'Mot marken'!N165","v":0.9733031761912222},{"$f":"'Mot marken'!O165","v":0.71504293669162244},{"$f":"'Mot marken'!P165","v":0},{"$f":"'Mot marken'!Q165","v":0},{"$f":"'Mot marken'!R165","v":0},{"$f":"'Mot marken'!S165","v":0},{"$f":"'Mot marken'!T165","v":0},{"$f":"'Mot marken'!U165","v":0},{"$f":"'Mot marken'!V165","v":0},{"$f":"'Mot marken'!W165","v":0},{"$f":"'Mot marken'!X165","v":0},{"$f":"'Mot marken'!Y165","v":0},4.4046231507164233]
["Direkt mot ytan",{"$f":"IF(AND(B151>$L8,B152<$M8,B151<$L9),0,IF(SIN(B151*PI()/180)*(COS($C$7*PI()/180))+COS(B151*PI()/180)*SIN($C$7*PI()/180)*(COS((B152-($C$8-180))*PI()/180))<0,0,B153*(SIN(B151*PI()/180)*(COS($C$7*PI()/180))+COS(B151*PI()/180)*SIN($C$7*PI()/180)*(COS((B152-($C$8-180))*PI()/180)))))","v":0},0,0,0,0,0,0,0,0,1.1966555819783902,{"$f":"IF(AND(L151>$L8,L152<$M8,L151<$L9),0,IF(SIN(L151*PI()/180)*(COS($C$7*PI()/180))+COS(L151*PI()/180)*SIN($C$7*PI()/180)*(COS((L152-($C$8-180))*PI()/180))<0,0,L153*(SIN(L151*PI()/180)*(COS($C$7*PI()/180))+COS(L151*PI()/180)*SIN($C$7*PI()/180)*(COS((L152-($C$8-180))*PI()/180)))))","v":3.2671169696904352},{"$f":"IF(AND(M151>$L8,M152<$M8,M151<$L9),0,IF(SIN(M151*PI()/180)*(COS($C$7*PI()/180))+COS(M151*PI()/180)*SIN($C$7*PI()/180)*(COS((M152-($C$8-180))*PI()/180))<0,0,M153*(SIN(M151*PI()/180)*(COS($C$7*PI()/180))+COS(M151*PI()/180)*SIN($C$7*PI()/180)*(COS((M152-($C$8-180))*PI()/180)))))","v":3.9473814686151121},3.2671169696904374,1.1966555819784013,0,0,0,0,0,0,0,0,0,0,{"$f":"SUM(B156:Y156)","v":12.874926571952777},null,"Dec"]
["Diffus mot ytan",{"$f":"(B155)*(2+(COS($C$7*PI()/180)))/3","v":0},{"$f":"(C155)*(2+(COS($C$7*PI()/180)))/3","v":0},0,0,0,0,0,0,0,0.64523252758580962,0.87827854280588757,0.92757292584183249,0.87827854280588757,0.6452325275858114,0,0,0,0,0,0,0,0,0,0,{"$f":"SUM(B157:Y157)","v":3.9745950666252288}]
["Markrefl. mot ytan",{"$f":"$F$8*B154*(1-COS($C$7*PI()/180))/2","v":0},{"$f":"$F$8*C154*(1-COS($C$7*PI()/180))/2","v":0},0,0,0,0,0,0,0,6.053509979823922E-2,0.10569410209749223,0.12109699680382638,0.10569410209749226,6.0535099798239476E-2,0,0,0,0,0,0,0,0,0,0,{"$f":"SUM(B158:Y158)","v":0.45355540059528954}]
["Summa mot ytan",{"$f":"SUM(B156:B158)","v":0},{"$f":"SUM(C156:C158)","v":0},0,0,0,0,0,0,0,1.9024232093624391,4.2510896145938144,4.9960513912607709,4.2510896145938171,1.9024232093624522,0,0,0,0,0,0,0,0,0,0,17.303077039173296,{"$f":"Z159/Z$162","v":1.4457352921927723E-2}]
[null,null,null,null,null,null,null,null,null,null,null,null,null,null,null,null,null,null,null,null,null,null,null,null,null,"Summa",{"$f":"SUM(AA26:AA159)","v":1}]
[]
["OM($L$9>B14;0;OM(ABS(B15-$C$8)>90;OM(B14>$C$7;B16;0);B16)*(SIN(B14*PI()/180)*COS($C$7*PI()/180)+COS(B14*PI()/180)*SIN($C$7*PI()/180)*COS(ABS(B15-$C$8)*PI()/180)))",null,null,null,null,null,null,null,null,null,null,null,null,null,null,null,"tidigare",null,null,null,null,null,null,null,"Summa året",{"$f":"Z27+Z39+Z51+Z63+Z75+Z87+Z99+Z111+Z123+Z135+Z147+Z159","v":1196.8357646529755},"kWh/m2"]
["OM($L$9>B16;0;OM(ABS((B17-180)-($C$8-180))>90;0;B18))*(SIN(B16*PI()/180))*(SIN(B16*PI()/180)*ABS(COS($C$7*PI()/180))+COS(B16*PI()/180)*SIN($C$7*PI()/180)*ABS(COS((B17-$C$8)*PI()/180)))",null,null,null,null,null,null,null,null,null,null,null,null,null,null,null,null,null,null,null,null,null,null,"Diffusstr. fr himlen",null,{"$f":"Z25+Z37+Z49+Z61+Z73+Z85+Z97+Z109+Z121+Z133+Z145+Z157","v":412.75905350255601},"kWh/m3"]
[]
["(B18)*(1+COS($C$7*PI()/180))/2"]
["(B20)*(1+(COS($C$7*PI()/180)))/2"]
[null,null,null,null,null,null,"om(sin(b16*PI()/180)/(COS($C$8*PI()/180)>sin($c$7-90);b18;om(abs(b17-$c$8))<90;b18;0))"]
["Summa IDH",{"$f":"Z24+Z36+Z48+Z60+Z72+Z84+Z96+Z108+Z120+Z132+Z144+Z156","v":744.57448039182043},null,null,null,null,{"$f":"IF(SIN(B19*PI()/180)/(COS($C$8*PI()/180))>SIN($C$7-90),B21,IF(ABS(B20-$C$8)<90,B21,0))","v":0}]
["Summa IdH",{"$f":"Z25+Z37+Z49+Z61+Z73+Z85+Z97+Z109+Z121+Z133+Z145+Z157","v":412.75905350255601},null,null,null,null,{"$f":"SIN(B19*PI()/180)/(COS($C$8*PI()/180))","v":0}]
["Summa",{"$f":"SUM(B168:B169)","v":1157.3335338943764},null,null,null,null,{"$f":"IF(ABS(B20-$C$8)<90,B21,0)","v":0}]

{"sheet":"Diffus stråln","index":9,"n_rows":25,"n_cols":4,"rows_kept":25,"cut":false,"hidden":false,"merged":[]}
["Diffus himmelsstrålning mot lutan yta - jämförelse mellan isotrop och anisotrop fördelning enligt Koronakis"]
[]
["Isotrop","Id (α,β) = Id*(1+(COS(α*PI()/180)))/2"]
["Anisotrop","Id (α,β) = Id*(2+(COS(α*PI()/180)))/3 (Koronakis)"]
["Id = diffusstrålning mot horisontalplanet"]
[null,"Ytans lutning,α","Isotrop","Anisotrop"]
[null,0,{"$f":"(1+(COS(B7*PI()/180)))/2","v":1},{"$f":"(2+(COS(B7*PI()/180)))/3","v":1}]
[null,5,{"$f":"(1+(COS(B8*PI()/180)))/2","v":0.99809734904587277},{"$f":"(2+(COS(B8*PI()/180)))/3","v":0.99873156603058177}]
[null,10,0.99240387650610407,0.99493591767073608]
[null,15,0.9829629131445341,0.98864194209635603]
[null,20,0.96984631039295421,0.97989754026196951]
[null,25,0.95315389351832502,0.96876926234555005]
[null,30,0.93301270189221941,0.95534180126147961]
[null,35,0.90957602214449595,0.93971734809633067]
[null,40,0.88302222155948895,0.9220148143729926]
[null,45,0.85355339059327373,0.90236892706218252]
[null,50,0.82139380484326963,0.88092920322884638]
[null,55,0.78678821817552302,0.85785881211701531]
[null,60,0.75,0.83333333333333337]
[null,65,0.71130913087034975,0.80753942058023309]
[null,70,0.67101007166283444,0.78067338110855633]
[null,75,0.62940952255126037,0.75293968170084025]
[null,80,0.58682408883346526,0.72454939255564355]
[null,85,0.54357787137382907,0.69571858091588601]
[null,90,0.5,0.66666666666666663]

{"sheet":"Sparade orter","index":10,"n_rows":122,"n_cols":17,"rows_kept":122,"cut":false,"hidden":false,"merged":[]}
["Inmatning för sparade värden"]
["Plats"]
[null,null,null,"SMHI nr",null,"Latitud",null,"Longitud"]
["Markrefl s/v",0.2,0.8,"jan","feb","mar","apr","maj","jun","jul","aug","sep","okt","nov","dec","Medel"]
["Utetemperatur",null,null,null,null,null,null,null,null,null,null,null,null,null,null,{"$f":"AVERAGE(D5:O5)","v":{"$error":"#DIV/0!"}}]
["Orientering","Hor avsk","Lutning",null,null,null,null,null,null,null,null,null,null,null,null,"Orient","Summa"]
[{"$f":"IF(P7=0,\"Norr\",\"\")","v":"Norr"},0,90,null,null,null,null,null,null,null,null,null,null,null,null,0,{"$f":"SUM(D7:O7)","v":0}]
[{"$f":"IF(P8=90,\"Öster\",\"\")","v":"Öster"},0,90,null,null,null,null,null,null,null,null,null,null,null,null,90,{"$f":"SUM(D8:O8)","v":0}]
[{"$f":"IF(P9=180,\"Söder\",\"\")","v":"Söder"},0,90,null,null,null,null,null,null,null,null,null,null,null,null,180,0]
[{"$f":"IF(P10=270,\"Väster\",\"\")","v":"Väster"},0,90,null,null,null,null,null,null,null,null,null,null,null,null,270,0]
["Horisontell yta",null,0,null,null,null,null,null,null,null,null,null,null,null,null,null,0]
["Modell",0,90,null,null,null,null,null,null,null,null,null,null,null,null,90,{"$f":"SUM(D12:O12)","v":0}]
[]
["Plats"]
["Malmö Jägerso",null,null,"SMHI nr",5235,"Latitud",55.575361000000001,"Longitud",13.064717999999999]
["Markrefl s/v",0.2,0.3,"jan","feb","mar","apr","maj","jun","jul","aug","sep","okt","nov","dec","Medel"]
["Utetemperatur",null,null,-0.7,-0.6,2,6,11.3,15.3,16.5,16.399999999999999,13,9.1,4.5,1.3,7.8]
["Orientering","Hor avsk","Lutning",null,null,null,null,null,null,null,null,null,null,null,null,"Orient","Summa"]
[{"$f":"IF(P19=0,\"Norr\",\"\")","v":"Norr"},5,90,8.8859992675710373,15.436642468167594,36.046030787014118,56.911645623108974,70.574196915328827,75.365818927549157,71.873078382139198,58.036087933136258,40.045448917426491,24.628985388207969,11.424884128745852,6.6100426144368205,0,{"$f":"SUM(D19:O19)","v":475.83886135283234}]
[{"$f":"IF(P20=90,\"Öster\",\"\")","v":"Öster"},5,90,11.767693274340031,20.884555050861756,56.559313948431715,90.57873953243633,106.23459875288549,108.64130679860651,108.357586400418,82.731977391725707,63.005749639228476,36.759877191790807,15.15908302069289,8.2625239156800276,90,{"$f":"SUM(D20:O20)","v":708.9430049170976}]
[{"$f":"IF(P21=180,\"Söder\",\"\")","v":"Söder"},5,90,24.272811577050074,34.197702175568239,81.659263783337138,104.72270505562813,102.91705687064911,100.77610258442812,104.96325081511658,93.107028175959655,91.099857821555503,66.404322634622602,31.363648390908409,18.898579883195072,180,854.38232976801862]
[{"$f":"IF(P22=270,\"Väster\",\"\")","v":"Väster"},5,90,11.767693274340042,20.88455505086176,56.559313948431715,90.578739532436344,106.2345987528855,108.64130679860652,108.35948477484696,82.731977391725721,63.005749639228469,36.7598771917908,15.159083020692899,8.2625239156800312,270,708.94490329152688]
["Horisontell yta",5,0,13.673359999999997,24.887310000000003,69.65706000000003,116.5354215664827,151.41666170669316,158.68934585691667,154.48325506292761,112.3046738137455,82.65922999999998,46.321439999999996,17.608330000000002,9.8052191176241976,null,{"$f":"SUM(D23:O23)","v":958.04130712438985}]
[]
["Plats"]
["Kalmar",null,null,"SMHI nr",6642,"Latitud",56.678283999999998,"Longitud",16.289121999999999,null,null,null,null,"KALMAR FLYGPLATS",null,6283560,1529660]
["Markrefl s/v",0.2,0.4,"jan","feb","mar","apr","maj","jun","jul","aug","sep","okt","nov","dec","Medel"]
["Utetemperatur",null,null,-1.9,-1.9,0.7,4.3,9.8000000000000007,14.7,16.399999999999999,15.7,12,8,3.3,-0.1,{"$f":"AVERAGE(D28:O28)","v":6.75}]
["Orientering","Hor avsk","Lutning",null,null,null,null,null,null,null,null,null,null,null,null,"Orient","Summa"]
[{"$f":"IF(P30=0,\"Norr\",\"\")","v":"Norr"},5,90,9.1614132425244037,16.930836746913087,41.265127972636222,64.291464689858699,73.76641228324776,79.975667659123758,76.820882599313208,61.203978386941145,41.485365029612289,24.458601543685912,12.146006105082968,6.2747428936288623,0,{"$f":"SUM(D30:O30)","v":507.78049915256827}]
[{"$f":"IF(P31=90,\"Öster\",\"\")","v":"Öster"},5,90,11.115250922455605,23.008127954451588,64.829595074001219,101.94338836588095,115.94165624949261,120.24023597098648,118.35946225953258,92.030404459435076,67.847867770631751,37.100028063553403,14.890051369747864,7.7888197535565782,90,{"$f":"SUM(D31:O31)","v":775.09488821372577}]
[{"$f":"IF(P32=180,\"Söder\",\"\")","v":"Söder"},5,90,22.591189470116792,38.323413861715608,94.560212747325465,118.85289202253703,113.32677559645153,111.84865690965211,115.78029808494719,105.87457265863996,101.10868739934344,68.95748804297358,31.007303663911774,17.884782852272533,180,940.11627330988711]
[{"$f":"IF(P33=270,\"Väster\",\"\")","v":"Väster"},5,90,11.115250922455607,23.008127954451592,64.829595074001219,101.94338836588093,115.94165624949262,120.2402359709865,118.4445617115606,92.030404459435104,67.847867770631737,37.100028063553403,14.890051369747868,7.7888197535565817,270,775.17998766575374]
["Horisontell yta",5,0,12.766798786538562,25.622239999999998,74.565339999999992,122.6584255251955,165.35411826876935,176.50808765505855,168.31756698145122,124.69635791186761,88.196180000000012,46.214859999999994,17.098681845187247,8.5978327817426905,null,1030.5964897558108]
[]
["Plats"]
["Göteborg Liseberg",null,null,"SMHI nr",7142,"Latitud","57,699635°","Longitud",11.997374000000001,null,null,"GÖTEBORG","A/GÖTEBORG","SOL",6403580,1273020]
["Markrefl s/v",0.2,0.4,"jan","feb","mar","apr","maj","jun","jul","aug","sep","okt","nov","dec","Medel"]
["Utetemperatur",null,null,-1.1000000000000001,-1.2,1.6,5.8,11.6,15.6,17,16.2,12.7,8.9,4.2,0.8,{"$f":"AVERAGE(D39:O39)","v":7.6750000000000007}]
["Orientering","Hor avsk","Lutning",null,null,null,null,null,null,null,null,null,null,null,null,"Orient","Summa"]
[{"$f":"IF(P41=0,\"Norr\",\"\")","v":"Norr"},5,90,9.0172008458507111,17.167780975924437,39.279628983698018,60.981912731563725,72.388904560592621,80.952219224530523,74.843318138756487,58.407070911893278,40.053603956235648,22.656168427630664,11.576152526702719,6.3946449072051426,0,{"$f":"SUM(D41:O41)","v":493.71860619058407}]
[{"$f":"IF(P42=90,\"Öster\",\"\")","v":"Öster"},5,90,11.817403799368728,24.30550985342931,65.296687068792735,98.445830111227522,110.68287686457293,114.08574430530919,111.73425035554726,87.635160387638294,65.881961425460091,35.495743336535021,14.687581417277658,8.752863196685583,90,{"$f":"SUM(D42:O42)","v":748.82161212184428}]
[{"$f":"IF(P43=180,\"Söder\",\"\")","v":"Söder"},5,90,28.541191052518244,42.854834430917123,99.040122381270649,116.25332462417931,109.39555186454403,105.43350784933685,110.48677624805877,101.52796923858672,99.380657036615233,68.862861436640088,33.270118355860859,25.216493935637953,180,940.26340845416576]
[{"$f":"IF(P44=270,\"Väster\",\"\")","v":"Väster"},5,90,11.81740379936873,24.305509853429314,65.296687068792735,98.445830111227551,110.68287686457295,114.08574430530919,112.04013670219342,87.635160387638308,65.881961425460091,35.495743336535028,14.687581417277661,8.7528631966855901,270,749.12749846849056]
["Horisontell yta",5,0,13.34451428557178,26.742229999999999,74.383840000000006,117.76255777055198,156.29450524211632,162.33976999999999,157.31039541759242,117.98575095148182,84.857340000000008,43.650030000000001,16.623920143431643,9.3341291447190482,null,980.62898295546506]
[]
["Plats"]
["Jönköping",null,null,"SMHI nr",7447,"Latitud",57.766267999999997,"Longitud",14.180394,null,null,null,null,"JÖNKÖPING",null,6405780,1403300]
["Markrefl s/v",0.2,0.5,"jan","feb","mar","apr","maj","jun","jul","aug","sep","okt","nov","dec","Medel"]
["Utetemperatur",null,null,-2.6,-2.7,0.3,4.7,10,14.5,15.9,15,11.3,7.5,2.8,-0.7,{"$f":"AVERAGE(D50:O50)","v":6.333333333333333}]
["Orientering","Hor avsk","Lutning",null,null,null,null,null,null,null,null,null,null,null,null,"Orient","Summa"]
[{"$f":"IF(P52=0,\"Norr\",\"\")","v":"Norr"},5,90,8.663732688230608,15.924538775209889,42.175911832635087,66.321331276067994,71.649317617373669,80.277547547483294,72.760405501183129,56.801247187411171,37.657825907616029,20.888933755827523,10.280014453205904,5.6449359374229902,0,{"$f":"SUM(D52:O52)","v":489.04574247966724}]
[{"$f":"IF(P53=90,\"Öster\",\"\")","v":"Öster"},5,90,10.756220339217425,22.550596881212552,67.171128652615351,105.02417933278286,107.97511820727674,111.69017067659225,106.82609897150516,82.155587469508092,59.249424278028712,31.35015142130699,12.628584687147365,6.3629579980871993,90,{"$f":"SUM(D53:O53)","v":723.74021891528071}]
[{"$f":"IF(P54=180,\"Söder\",\"\")","v":"Söder"},5,90,23.268189240352775,39.806292986048057,99.646896406073679,123.48596336455857,106.82075678638371,103.51437972396596,105.73675051762312,94.249952046251749,87.302941043002505,58.593436951586007,26.671791926793286,14.776585391923975,180,883.87393638456342]
[{"$f":"IF(P55=270,\"Väster\",\"\")","v":"Väster"},5,90,10.756220339217426,22.550596881212556,67.171128652615337,105.02417933278291,107.97511820727675,111.69017067659227,107.12731361853196,82.155587469508106,59.249424278028698,31.35015142130699,12.628584687147365,6.3629579980871993,270,724.04143356230747]
["Horisontell yta",5,0,11.512124702960918,23.445309999999996,72.365490000000023,118.59215745252568,152.09395052060134,158.45182000000003,149.97499553800952,110.30892857374472,76.339799999999997,38.71056999999999,13.527543308848442,7.0444796185176077,null,932.36716971520809]
[]
["Plats"]
["Stockholm Bromma",null,null,"SMHI nr",9720,"Latitud",59.353265,"Longitud",17.947934,null,null,null,null,"STOCKHOLM-BROMMA",null,6583350,1621880]
["Markrefl s/v",0.2,0.4,"jan","feb","mar","apr","maj","jun","jul","aug","sep","okt","nov","dec","Medel"]
["Utetemperatur",null,null,-3.5,-3.7,-0.5,4.3,10.4,15.2,16.8,15.8,11.4,7,2,-1.8,{"$f":"AVERAGE(D61:O61)","v":6.1166666666666671}]
["Orientering","Hor avsk","Lutning",null,null,null,null,null,null,null,null,null,null,null,null,"Orient","Summa"]
[{"$f":"IF(P63=0,\"Norr\",\"\")","v":"Norr"},5,90,7.0837065319012948,14.783576043789722,36.782068124046177,59.901789074759698,71.989040102683006,80.901192915834244,73.871810109818284,56.343324287378579,38.478722796474749,20.713793064463093,8.9752789242776991,4.768931960046384,0,{"$f":"SUM(D63:O63)","v":474.59323393547299}]
[{"$f":"IF(P64=90,\"Öster\",\"\")","v":"Öster"},5,90,9.5567417836214386,21.788076520713474,63.003336609343236,101.15129647292342,111.17355633793055,118.05360975472173,114.6540249533484,90.088447674477393,64.889135515041019,33.114214555654279,12.101766231664445,5.7750942282082338,90,{"$f":"SUM(D64:O64)","v":745.34930063764762}]
[{"$f":"IF(P65=180,\"Söder\",\"\")","v":"Söder"},5,90,24.852773748574855,41.034897281099468,98.516313161174679,122.45570860213741,111.62457108552709,109.2434177571695,115.1318718126529,107.51701982809135,100.6582810132669,67.187834877401144,31.439480790543108,17.834020922030302,180,947.49619087966869]
[{"$f":"IF(P66=270,\"Väster\",\"\")","v":"Väster"},5,90,9.5567417836214439,21.788076520713478,63.003336609343229,101.15129647292343,111.17355633793055,118.05360975472176,115.6874382084315,90.088447674477365,64.889135515041005,33.114214555654279,12.101766231664451,5.7750942282082347,270,746.38271389273075]
["Horisontell yta",5,0,10.476792276355489,23.538679999999996,70.577409999999986,119.79013803419133,155.71564056502174,167.41976479521782,160.95984531310279,120.35448423734698,82.225619999999992,39.987610000000011,13.267974549930575,6.6391123908378891,null,970.95307216200456]
[]
["Plats"]
["Gävle",null,null,"SMHI nr",10740,"Latitud",60.653112,"Longitud",17.165952000000001,null,null,null,null,null,"GÄVLE",6726980,1574430]
["Markrefl s/v",0.2,0.5,"jan","feb","mar","apr","maj","jun","jul","aug","sep","okt","nov","dec","Medel"]
["Utetemperatur",null,null,-4.8,-4.5,-1,3.4,9.3000000000000007,14.6,16.3,14.9,10.6,6,0.6,-3.3,{"$f":"AVERAGE(D72:O72)","v":5.1749999999999998}]
["Orientering","Hor avsk","Lutning",null,null,null,null,null,null,null,null,null,null,null,null,"Orient","Summa"]
[{"$f":"IF(P74=0,\"Norr\",\"\")","v":"Norr"},5,90,6.2533221109322561,14.545431303387982,37.674269981342853,63.019756258021907,69.221741452405496,80.037164656410383,72.954170825443768,54.712535125193526,35.594623928143704,17.847436470973932,8.0620971484755373,4.1659430719067654,0,{"$f":"SUM(D74:O74)","v":464.08849233263811}]
[{"$f":"IF(P75=90,\"Öster\",\"\")","v":"Öster"},5,90,9.0878998151940493,20.484568224846861,65.760440539498717,104.43554451750596,107.64302196253173,115.62235514973759,112.87295281143169,88.697912638514907,60.319180095928814,27.874917537170695,11.301957145017219,5.4434796181111222,90,{"$f":"SUM(D75:O75)","v":729.54423005548949}]
[{"$f":"IF(P76=180,\"Söder\",\"\")","v":"Söder"},5,90,27.332676499329757,40.746609009924263,105.07596921721945,127.11717028924389,109.41693518806292,108.27851841822481,114.76978449076408,107.31022564433754,94.929060251918912,62.084809146297317,32.155335775595887,21.245849513673793,180,950.4629434445925]
[{"$f":"IF(P77=270,\"Väster\",\"\")","v":"Väster"},5,90,9.0878998151940564,20.484568224846868,65.760440539498717,104.43554451750597,107.64302196253178,115.62235514973761,114.51787499296098,88.697912638514893,60.319180095928807,27.87491753717071,11.301957145017228,5.4434796181111231,270,731.18915223701879]
["Horisontell yta",5,0,9.0731842537628804,21.64920410879261,68.660389999999992,115.69416054104556,149.74291033527956,162.42321344529194,157.34556874910638,117.43210174368306,75.437170000000009,35.018776610513356,11.368290987074829,5.7035513755016165,null,929.54852215005189]
[]
["Plats"]
["Ljusdal",null,null,"SMHI nr",11650,"Latitud",61.832438000000003,"Longitud",16.130011,null,null,null,null,null,"LJUSDAL",6857670,1517120]
["Markrefl s/v",0.2,0.5,"jan","feb","mar","apr","maj","jun","jul","aug","sep","okt","nov","dec","Medel"]
["Utetemperatur",null,null,-9.1,-7.8,-2.8,2.5,8.8000000000000007,14,15.4,13.7,9.1,4.3,-2.2999999999999998,-7.2,{"$f":"AVERAGE(D83:O83)","v":3.2166666666666668}]
["Orientering","Hor avsk","Lutning",null,null,null,null,null,null,null,null,null,null,null,null,"Orient","Summa"]
[{"$f":"IF(P85=0,\"Norr\",\"\")","v":"Norr"},5,90,5.1735781979865498,12.692284820317493,35.613553281363181,60.515519344698482,65.811161028998995,78.669568211886613,71.763766639531667,51.559304437800719,34.470674462826018,17.055019585577135,7.2388165940400278,3.3938867613747794,0,{"$f":"SUM(D85:O85)","v":443.95713336640171}]
[{"$f":"IF(P86=90,\"Öster\",\"\")","v":"Öster"},5,90,6.338328141559054,18.525529911996546,62.065291285361319,97.217286434547418,98.910972519976255,108.8937141814842,106.66009398710125,81.040683194363538,58.873238632549523,27.028112366425688,8.6106872723078904,3.3938867613747794,90,{"$f":"SUM(D86:O86)","v":677.55782468904749}]
[{"$f":"IF(P87=180,\"Söder\",\"\")","v":"Söder"},5,90,19.638800988058744,38.829829145718676,100.19490226975968,118.32167498553468,101.45726283433189,103.52401086284728,109.45020745050287,97.993176810656166,94.049009641348192,61.742350654969066,24.276306151193843,3.3938867613747794,180,872.87141855629591]
[{"$f":"IF(P88=270,\"Väster\",\"\")","v":"Väster"},5,90,6.3383281415590558,18.525529911996557,62.065291285361312,97.217286434547418,98.910972519976255,108.89371418148419,108.60404847335143,81.040683194363552,58.87323863254953,27.028112366425695,8.6106872723078904,3.3938867613747794,270,679.50177917529777]
["Horisontell yta",5,0,6.9658741043387984,19.214388119521178,64.001080000000016,106.67372236361818,136.14940182985978,150.95129417291949,147.12671042030561,106.31178942021954,72.702799999999996,33.265774134588561,9.4539398214649104,3.3501101420621699,null,856.16688452889821]
[]
["Plats"]
["Östersund",null,null,"SMHI nr",13410,"Latitud",63.172637000000002,"Longitud",14.675606999999999,null,null,null,null,"ÖSTERSUND",null,7007500,1443110]
["Markrefl s/v",0.2,0.6,"jan","feb","mar","apr","maj","jun","jul","aug","sep","okt","nov","dec","Medel"]
["Utetemperatur",null,null,-8.9,-7.6,-3.5,1.3,7.6,12.5,13.9,12.7,8.1999999999999993,3.8,-2.4,-6.3,{"$f":"AVERAGE(D94:O94)","v":2.6083333333333334}]
["Orientering","Hor avsk","Lutning",null,null,null,null,null,null,null,null,null,null,null,null,"Orient","Summa"]
[{"$f":"IF(P96=0,\"Norr\",\"\")","v":"Norr"},5,90,4.2694263904151102,14.011105998321701,38.906513715997974,66.898405584186563,68.430323532378921,77.727186790418415,71.017977097712574,50.062718590828098,33.857721617158575,16.363774849370351,6.6013213329871654,2.5919955431669939,0,{"$f":"SUM(D96:O96)","v":450.73847104294242}]
[{"$f":"IF(P97=90,\"Öster\",\"\")","v":"Öster"},5,90,4.9624940841172487,18.187912256964292,57.299637749326834,93.579761708767322,92.024664445211741,101.18694316066519,96.177729941124156,71.168136521525554,51.368993762089552,23.84827506247218,7.6240624035218767,2.5919955431669939,90,{"$f":"SUM(D97:O97)","v":620.02060663895281}]
[{"$f":"IF(P98=180,\"Söder\",\"\")","v":"Söder"},5,90,13.031180424751803,33.101334018957871,84.695999327490995,109.72260941201829,93.068310680367674,97.798897200730039,97.290618893160897,83.937410533607476,77.451846381734313,50.571925010265844,19.530802511041518,2.5919955431669939,180,762.79292993729371]
[{"$f":"IF(P99=270,\"Väster\",\"\")","v":"Väster"},5,90,4.9624940841172487,18.187912256964299,57.299637749326834,93.579761708767307,92.024664445211769,101.18694316066519,96.177729941124184,71.168136521525554,51.368993762089545,23.848275062472183,7.6240624035218776,2.5919955431669939,270,620.02060663895293]
["Horisontell yta",5,null,5.0574217078681869,17.898135986634021,56.218730000000015,96.474869444708389,122.71938000000002,138.08470092699741,128.31471000000005,92.517240438579051,63.333649999999992,29.060062857072033,7.7745253813128912,2.5253393147504912,null,759.97876605792248]
[]
["Plats"]
["Luleå",null,null,"SMHI nr",16298,"Latitud",65.618831,"Longitud",22.126276000000001,null,null,null,null,"Luleå",7294340,1790910]
["Markrefl s/v",0.2,0.8,"jan","feb","mar","apr","maj","jun","jul","aug","sep","okt","nov","dec","Medel"]
["Utetemperatur",null,null,-12.2,-11,-6,0.3,6.6,13,15.4,13.3,8,2.6,-4.5,-9.6999999999999993,{"$f":"AVERAGE(D105:O105)","v":1.3166666666666673}]
["Orientering","Hor avsk","Lutning",null,null,null,null,null,null,null,null,null,null,null,null,"Orient","Summa"]
[{"$f":"IF(P107=0,\"Norr\",\"\")","v":"Norr"},5,90,2.5745787083700984,13.261145419707795,43.738635879926811,75.194692022984285,73.999518192312138,87.177077103700455,78.162578398102468,53.295257342504257,31.446109968019115,13.069767466356108,4.7975806882683809,1.7038374412181294,0,{"$f":"SUM(D107:O107)","v":478.42077863147006}]
[{"$f":"IF(P108=90,\"Öster\",\"\")","v":"Öster"},5,90,2.5745787083700984,18.757287166388707,67.555615920808791,109.96705608757537,115.23833235848096,119.26123915325829,118.35901232570455,88.009093789846332,50.774421349340464,20.332035248302372,4.7975806882683809,1.7038374412181294,90,{"$f":"SUM(D108:O108)","v":717.33009023756256}]
[{"$f":"IF(P109=180,\"Söder\",\"\")","v":"Söder"},5,90,2.5745787083700984,39.57170591385875,105.18146603083112,132.79913343783662,118.65311129570016,114.22799353795358,121.6874769943105,110.80274099248589,81.30911322316814,47.834943585951173,4.7975806882683809,1.7038374412181294,180,881.14368184995249]
[{"$f":"IF(P110=270,\"Väster\",\"\")","v":"Väster"},5,90,2.5745787083700984,18.757287166388718,67.555615920808791,109.96705608757541,115.23833235848097,119.26123915325832,118.35901232570455,88.009093789846332,50.77442134934045,20.33203524830239,4.7975806882683809,1.7038374412181294,270,717.33009023756256]
["Horisontell yta",5,0,2.1802720625551477,15.983369781047005,58.409570000000002,101.00936631233115,151.75208010589344,160.30644543232552,155.78610318973543,111.99854594633889,60.668059999999976,23.579848996734665,4.1542210324025728,1.5588141618271942,null,847.38669702119103]
[]
["Plats"]
["Kiruna",null,null,"SMHI nr",18094,"Latitud",67.825541999999999,"Longitud",20.334382000000002,null,null,null,null,"KIRUNA FLYGPLATS",null,7532780,1690720]
["Markrefl s/v",0.2,0.8,"jan","feb","mar","apr","maj","jun","jul","aug","sep","okt","nov","dec","Medel"]
["Utetemperatur",null,null,-13.9,-12.5,-8.6999999999999993,-3.2,3.4,9.6,12,9.8000000000000007,4.5999999999999996,-1.4,-8.1,-11.9,{"$f":"AVERAGE(D116:O116)","v":-1.6916666666666664}]
["Orientering","Hor avsk","Lutning",null,null,null,null,null,null,null,null,null,null,null,null,"Orient","Summa"]
[{"$f":"IF(P118=0,\"Norr\",\"\")","v":"Norr"},5,90,1.5463424360147402,10.86383316557999,38.579425286636614,71.740491248992598,68.439080085258695,80.317186712381812,73.23460334038478,49.750585609778511,28.080547954455866,11.825903989561191,3.3146193585083443,1.1318233408444249,0,{"$f":"SUM(D118:O118)","v":438.82444252839764}]
[{"$f":"IF(P119=90,\"Öster\",\"\")","v":"Öster"},5,90,1.5463424360147402,13.705714871675948,56.607970747514017,98.231714917505258,94.443364480578879,96.821577805322164,98.416316817047331,72.553718769148873,42.913905458148506,15.697297523405133,3.3146193585083443,1.1318233408444249,90,{"$f":"SUM(D119:O119)","v":595.38436652571374}]
[{"$f":"IF(P120=180,\"Söder\",\"\")","v":"Söder"},5,90,1.5463424360147402,29.515020142002069,86.637736390708881,116.76028800507147,97.52481513766736,94.748310182974052,101.40029462469047,88.502756256272974,67.621514316791135,37.23374714649119,3.3146193585083443,1.1318233408444249,180,725.93726733803715]
[{"$f":"IF(P121=270,\"Väster\",\"\")","v":"Väster"},5,90,1.5463424360147402,13.705714871675951,56.607970747514017,98.231714917505258,94.443364480578865,96.821577805322164,98.416316817047374,72.553718769148873,42.913905458148506,15.697297523405137,3.3146193585083443,1.1318233408444249,270,595.38436652571374]
["Horisontell yta",5,0,1.3755036540221104,12.232828919152322,48.410240000000009,89.313864228640298,122.34569540337469,127.49390368591898,127.55441931322449,91.411277014423931,50.640550000000005,19.488744456405684,2.9627810377625163,1.0977350112666373,null,694.32754272419163]

{"sheet":"Indata","index":11,"n_rows":125,"n_cols":59,"rows_kept":125,"cut":false,"hidden":false,"merged":[]}
["Gävle",null,null,null,null,null,"Göteborg Liseberg",null,null,null,null,null,"Jönköping",null,null,null,null,null,"Kalmar flygplats",null,null,null,null,null,"Kiruna flygplats",null,null,null,null,null,"Ljusdal",null,null,null,null,null,"Luleå",null,null,null,null,null,"Malmö Jägerso",null,null,null,null,null,"Stockholm Bromma",null,null,null,null,null,"Östersund"]
["Latitud",60.653112,null,null,null,null,"Latitud",57.699635000000001,null,null,13027.4,null,"Latitud",57.766267999999997,null,null,null,null,"Latitud",56.678283999999998,null,null,null,null,"Latitud",67.825541999999999,null,null,null,null,"Latitud",61.832438000000003,null,null,null,null,"Latitud",65.618831,null,null,null,null,"Latitud",55.575361000000001,null,null,null,null,"Lat",59.353265,null,null,null,null,"Latitud",63.172637000000002]
["Longitud",17.165952000000001,null,null,null,null,"Longitud",11.9977374,null,null,null,null,"Longitud",14.180394,null,null,null,null,"Longitud",16.289121999999999,null,null,null,null,"Longitud",20.334382000000002,null,null,null,null,"Longitud",16.130011,null,null,null,null,"Longitud",22.126276000000001,null,null,null,null,"Longitud",13.064717999999999,null,null,null,null,"Long",17.947934,null,null,null,null,"Longitud",14.675606999999999]
["SMHI nr",10740,null,null,null,null,"SMHI nr",7142,null,null,null,null,"SMHI nr",7447,null,null,null,null,"SMHI nr",6642,null,null,null,null,"SMHI nr",18094,null,null,null,null,"SMHI nr",11650,null,null,null,null,"SMHI nr",16298,null,null,null,null,"SMHI nr",5235,null,null,null,null,"SMHI nr",9720,null,null,null,null,"SMHI nr",13410]
["Direktstrålning",null,null,"Globalstrålning",null,null,"Direktstrålning",null,null,"Globalstrålning",null,null,"Direktstrålning",null,null,"Globalstrålning",null,null,"Direktstrålning",null,null,"Globalstrålning",null,null,"Direktstrålning",null,null,"Globalstrålning",null,null,"Direktstrålning",null,null,"Globalstrålning",null,null,"Direktstrålning",null,null,"Globalstrålning",null,null,"Direktstrålning",null,null,"Globalstrålning",null,null,"Direktstrålning",null,null,"Globalstrålning",null,null,"Direktstrålning",null,null,"Globalstrålning"]
["2006 01 31 23",18698.099999999999,null,"2006 01 31 23",8618.7000000000007,null,"2006 01 31 23",25607,null,"2006 01 31 23",13027.4,null,"2006 01 31 23",25521.9,null,"2006 01 31 23",13587.3,null,"2006 01 31 23",17065.3,null,"2006 01 31 23",12539.7,null,"2006 01 31 23",3817.9,null,"2006 01 31 23",1207,null,"2006 01 31 23",21340.7,null,"2006 01 31 23",7408.5,null,"2006 01 31 23",11976.7,null,"2006 01 31 23",2754.2,null,"2006 01 31 23",19915.2,null,"2006 01 31 23",14123.6,null,"2006 01 31 23",18975.8,null,"2006 01 31 23",10386.9,null,"2006 01 31 23",13219,null,"2006 01 31 23",5258.1]
["2006 02 28 23",33519.699999999997,null,"2006 02 28 23",21319.1,null,"2006 02 28 23",35341.4,null,"2006 02 28 23",24289.4,null,"2006 02 28 23",38149.300000000003,null,"2006 02 28 23",25182.5,null,"2006 02 28 23",40967.5,null,"2006 02 28 23",26226.5,null,"2006 02 28 23",27220.5,null,"2006 02 28 23",13778.1,null,"2006 02 28 23",42369,null,"2006 02 28 23",21684.9,null,"2006 02 28 23",45434.6,null,"2006 02 28 23",17645.3,null,"2006 02 28 23",34507,null,"2006 02 28 23",27840.2,null,"2006 02 28 23",29310.2,null,"2006 02 28 23",22437.200000000001,null,"2006 02 28 23",32486.6,null,"2006 02 28 23",19391.099999999999]
["2006 03 31 23",92291.3,null,"2006 03 31 23",62200.6,null,"2006 03 31 23",96136.7,null,"2006 03 31 23",73269.899999999994,null,"2006 03 31 23",75690.2,null,"2006 03 31 23",65613.100000000006,null,"2006 03 31 23",66182.399999999994,null,"2006 03 31 23",67535.100000000006,null,"2006 03 31 23",74241.8,null,"2006 03 31 23",51339.6,null,"2006 03 31 23",97577.4,null,"2006 03 31 23",61245.7,null,"2006 03 31 23",110500.7,null,"2006 03 31 23",62865.7,null,"2006 03 31 23",78275.100000000006,null,"2006 03 31 23",73904.100000000006,null,"2006 03 31 23",85283.7,null,"2006 03 31 23",67249.7,null,"2006 03 31 23",99622,null,"2006 03 31 23",61437.1]
["2006 04 30 23",117748.7,null,"2006 04 30 23",102243.9,null,"2006 04 30 23",72937.5,null,"2006 04 30 23",91077.5,null,"2006 04 30 23",71619.100000000006,null,"2006 04 30 23",91029.7,null,"2006 04 30 23",89004.800000000003,null,"2006 04 30 23",103471,null,"2006 04 30 23",87212.9,null,"2006 04 30 23",85096.1,null,"2006 04 30 23",104834.8,null,"2006 04 30 23",96209.8,null,"2006 04 30 23",89813.4,null,"2006 04 30 23",84821,null,"2006 04 30 23",65409.1,null,"2006 04 30 23",95578.9,null,"2006 04 30 23",115860.5,null,"2006 04 30 23",109405.7,null,"2006 04 30 23",90640.5,null,"2006 04 30 23",95746.5]
["2006 05 31 23",161905.5,null,"2006 05 31 23",149017.20000000001,null,"2006 05 31 23",158148,null,"2006 05 31 23",157039.6,null,"2006 05 31 23",142178.9,null,"2006 05 31 23",148725,null,"2006 05 31 23",164887.5,null,"2006 05 31 23",165269.79999999999,null,"2006 05 31 23",118649.2,null,"2006 05 31 23",126932.9,null,"2006 05 31 23",150176,null,"2006 05 31 23",139632,null,"2006 05 31 23",165541.9,null,"2006 05 31 23",153780.4,null,"2006 05 31 23",156460.1,null,"2006 05 31 23",158854,null,"2006 05 31 23",166018.9,null,"2006 05 31 23",159499.29999999999,null,"2006 05 31 23",157591.4,null,"2006 05 31 23",148324.20000000001]
["2006 06 30 23",186428.79999999999,null,"2006 06 30 23",175390.8,null,"2006 06 30 23",163412.9,null,"2006 06 30 23",168001.7,null,"2006 06 30 23",198221.7,null,"2006 06 30 23",183379.1,null,"2006 06 30 23",186094,null,"2006 06 30 23",181928.5,null,"2006 06 30 23",142826.5,null,"2006 06 30 23",151050.1,null,"2006 06 30 23",162587.70000000001,null,"2006 06 30 23",163772,null,"2006 06 30 23",205503,null,"2006 06 30 23",182720.8,null,"2006 06 30 23",164156,null,"2006 06 30 23",172565.9,null,"2006 06 30 23",223001.7,null,"2006 06 30 23",192116,null,"2006 06 30 23",148532.70000000001,null,"2006 06 30 23",155492.20000000001]
["2006 07 31 23",195101.8,null,"2006 07 31 23",172922.8,null,"2006 07 31 23",213956.5,null,"2006 07 31 23",179788.9,null,"2006 07 31 23",223719.6,null,"2006 07 31 23",186724.9,null,"2006 07 31 23",229126.39999999999,null,"2006 07 31 23",194971.2,null,"2006 07 31 23",212109.8,null,"2006 07 31 23",169478.8,null,"2006 07 31 23",186990.5,null,"2006 07 31 23",163613.20000000001,null,"2006 07 31 23",239349.7,null,"2006 07 31 23",189055.5,null,"2006 07 31 23",216430.2,null,"2006 07 31 23",192416.7,null,"2006 07 31 23",246615.9,null,"2006 07 31 23",198293.3,null,"2006 07 31 23",174313.3,null,"2006 07 31 23",160520.20000000001]
["2006 08 31 23",134605,null,"2006 08 31 23",122114,null,"2006 08 31 23",95568.7,null,"2006 08 31 23",111736.7,null,"2006 08 31 23",105511.8,null,"2006 08 31 23",112185.8,null,"2006 08 31 23",101531.5,null,"2006 08 31 23",113230.5,null,"2006 08 31 23",173342.1,null,"2006 08 31 23",123414.8,null,"2006 08 31 23",121749.3,null,"2006 08 31 23",110760.6,null,"2006 08 31 23",199657.2,null,"2006 08 31 23",142248.1,null,"2006 08 31 23",68223.199999999997,null,"2006 08 31 23",103084.1,null,"2006 08 31 23",157487,null,"2006 08 31 23",133792.1,null,"2006 08 31 23",142846.6,null,"2006 08 31 23",124478.8]
["2006 09 30 23",102105.9,null,"2006 09 30 23",76471.399999999994,null,"2006 09 30 23",138073.79999999999,null,"2006 09 30 23",95479,null,"2006 09 30 23",131424.29999999999,null,"2006 09 30 23",93363.8,null,"2006 09 30 23",147571.5,null,"2006 09 30 23",102069,null,"2006 09 30 23",74217.399999999994,null,"2006 09 30 23",50138.1,null,"2006 09 30 23",82789.5,null,"2006 09 30 23",65727.399999999994,null,"2006 09 30 23",64928.4,null,"2006 09 30 23",54764,null,"2006 09 30 23",126041.60000000001,null,"2006 09 30 23",97159,null,"2006 09 30 23",126836.4,null,"2006 09 30 23",86163.4,null,"2006 09 30 23",80526.399999999994,null,"2006 09 30 23",66363]
["2006 10 31 23",36375.4,null,"2006 10 31 23",28525.3,null,"2006 10 31 23",40468.9,null,"2006 10 31 23",36634.1,null,"2006 10 31 23",25333.599999999999,null,"2006 10 31 23",30845.5,null,"2006 10 31 23",47916.9,null,"2006 10 31 23",40556.1,null,"2006 10 31 23",33137.699999999997,null,"2006 10 31 23",17138.3,null,"2006 10 31 23",34576.1,null,"2006 10 31 23",25394.7,null,"2006 10 31 23",33229.1,null,"2006 10 31 23",20216.2,null,"2006 10 31 23",36801.800000000003,null,"2006 10 31 23",41409.1,null,"2006 10 31 23",38526.300000000003,null,"2006 10 31 23",31337.4,null,"2006 10 31 23",24166.7,null,"2006 10 31 23",20060.8]
["2006 11 30 23",37072.800000000003,null,"2006 11 30 23",12680,null,"2006 11 30 23",28037.7,null,"2006 11 30 23",16410.2,null,"2006 11 30 23",26890.7,null,"2006 11 30 23",16236.7,null,"2006 11 30 23",30137.7,null,"2006 11 30 23",17873.599999999999,null,"2006 11 30 23",13657.6,null,"2006 11 30 23",2841.7,null,"2006 11 30 23",36639.5,null,"2006 11 30 23",11576.5,null,"2006 11 30 23",13348.3,null,"2006 11 30 23",4339.3999999999996,null,"2006 11 30 23",27756.400000000001,null,"2006 11 30 23",18076.599999999999,null,"2006 11 30 23",39080.6,null,"2006 11 30 23",14773.5,null,"2006 11 30 23",24369.8,null,"2006 11 30 23",8626.5]
["2006 12 31 23",24952.3,null,"2006 12 31 23",6136.9,null,"2006 12 31 23",16764.400000000001,null,"2006 12 31 23",7921,null,"2006 12 31 23",20288,null,"2006 12 31 23",8177.4,null,"2006 12 31 23",32570.3,null,"2006 12 31 23",11220.3,null,"2006 12 31 23",559.79999999999995,null,"2006 12 31 23",80.7,null,"2006 12 31 23",16420.8,null,"2006 12 31 23",4052,null,"2006 12 31 23",7847.7,null,"2006 12 31 23",841.5,null,"2006 12 31 23",14343.3,null,"2006 12 31 23",9628.4,null,"2006 12 31 23",25657,null,"2006 12 31 23",7941.5,null,"2006 12 31 23",8339.1,null,"2006 12 31 23",2231.3000000000002]
["2007 01 31 23",33108,null,"2007 01 31 23",10321.700000000001,null,"2007 01 31 23",31871.200000000001,null,"2007 01 31 23",13591.7,null,"2007 01 31 23",24209.8,null,"2007 01 31 23",11807.4,null,"2007 01 31 23",31808.6,null,"2007 01 31 23",14543.9,null,"2007 01 31 23",14933.3,null,"2007 01 31 23",1773.1,null,"2007 01 31 23",24951.9,null,"2007 01 31 23",7628.7,null,"2007 01 31 23",21247.7,null,"2007 01 31 23",3559.1,null,"2007 01 31 23",17774.7,null,"2007 01 31 23",13200.9,null,"2007 01 31 23",28575.599999999999,null,"2007 01 31 23",11470.2,null,"2007 01 31 23",21469.1,null,"2007 01 31 23",5654.3]
["2007 02 28 23",17190.2,null,"2007 02 28 23",15824.6,null,"2007 02 28 23",30242.5,null,"2007 02 28 23",22073.4,null,"2007 02 28 23",16176.9,null,"2007 02 28 23",17778.900000000001,null,"2007 02 28 23",18634.900000000001,null,"2007 02 28 23",18915.400000000001,null,"2007 02 28 23",29184.799999999999,null,"2007 02 28 23",11380.5,null,"2007 02 28 23",17538.599999999999,null,"2007 02 28 23",13821.6,null,"2007 02 28 23",31199.5,null,"2007 02 28 23",14146.9,null,"2007 02 28 23",15517.2,null,"2007 02 28 23",21426,null,"2007 02 28 23",19235,null,"2007 02 28 23",18116.099999999999,null,"2007 02 28 23",26660.799999999999,null,"2007 02 28 23",17067.3]
["2007 03 31 23",93726.9,null,"2007 03 31 23",62879.3,null,"2007 03 31 23",109785.8,null,"2007 03 31 23",75832.7,null,"2007 03 31 23",98716.9,null,"2007 03 31 23",70597.3,null,"2007 03 31 23",127848.6,null,"2007 03 31 23",81078.100000000006,null,"2007 03 31 23",117807.1,null,"2007 03 31 23",58137.5,null,"2007 03 31 23",108706.1,null,"2007 03 31 23",67635.899999999994,null,"2007 03 31 23",110028.7,null,"2007 03 31 23",57092.5,null,"2007 03 31 23",110830.9,null,"2007 03 31 23",83593,null,"2007 03 31 23",94179.199999999997,null,"2007 03 31 23",65166,null,"2007 03 31 23",95197.5,null,"2007 03 31 23",61315.6]
["2007 04 30 23",158774.9,null,"2007 04 30 23",122439.4,null,"2007 04 30 23",184133.9,null,"2007 04 30 23",137321.70000000001,null,"2007 04 30 23",201477,null,"2007 04 30 23",141744.5,null,"2007 04 30 23",195807,null,"2007 04 30 23",145576.29999999999,null,"2007 04 30 23",126755.8,null,"2007 04 30 23",102857.4,null,"2007 04 30 23",133696.5,null,"2007 04 30 23",110562.8,null,"2007 04 30 23",136943.5,null,"2007 04 30 23",111826.1,null,"2007 04 30 23",145215.29999999999,null,"2007 04 30 23",134489.5,null,"2007 04 30 23",180654.8,null,"2007 04 30 23",134188.70000000001,null,"2007 04 30 23",102510.2,null,"2007 04 30 23",97592.3]
["2007 05 31 23",117912.9,null,"2007 05 31 23",129178.2,null,"2007 05 31 23",117562.7,null,"2007 05 31 23",139002.4,null,"2007 05 31 23",130081.60000000001,null,"2007 05 31 23",142665.20000000001,null,"2007 05 31 23",166759.9,null,"2007 05 31 23",160838.6,null,"2007 05 31 23",145708.6,null,"2007 05 31 23",121078.5,null,"2007 05 31 23",78226.7,null,"2007 05 31 23",114483.3,null,"2007 05 31 23",119360.4,null,"2007 05 31 23",128114.6,null,"2007 05 31 23",132715.4,null,"2007 05 31 23",147389.70000000001,null,"2007 05 31 23",152124.1,null,"2007 05 31 23",148099.6,null,"2007 05 31 23",123508.2,null,"2007 05 31 23",135780]
["2007 06 30 23",197513.8,null,"2007 06 30 23",181300.5,null,"2007 06 30 23",156021.1,null,"2007 06 30 23",165051.70000000001,null,"2007 06 30 23",177514.1,null,"2007 06 30 23",170550.39999999999,null,"2007 06 30 23",164107.5,null,"2007 06 30 23",167933.3,null,"2007 06 30 23",183082,null,"2007 06 30 23",167174,null,"2007 06 30 23",198450.9,null,"2007 06 30 23",181765.7,null,"2007 06 30 23",202687.8,null,"2007 06 30 23",176364.3,null,"2007 06 30 23",121779.3,null,"2007 06 30 23",150795.5,null,"2007 06 30 23",218131.4,null,"2007 06 30 23",189149.8,null,"2007 06 30 23",240188.3,null,"2007 06 30 23",195456.6]
["2007 07 31 23",135708.1,null,"2007 07 31 23",145875,null,"2007 07 31 23",78591.600000000006,null,"2007 07 31 23",120214.8,null,"2007 07 31 23",97736.1,null,"2007 07 31 23",125501.2,null,"2007 07 31 23",119850,null,"2007 07 31 23",139294.20000000001,null,"2007 07 31 23",110852.7,null,"2007 07 31 23",124966.39999999999,null,"2007 07 31 23",99337.9,null,"2007 07 31 23",129491,null,"2007 07 31 23",146713.20000000001,null,"2007 07 31 23",140670.5,null,"2007 07 31 23",81187,null,"2007 07 31 23",123374.2,null,"2007 07 31 23",157687.4,null,"2007 07 31 23",156511.70000000001,null,"2007 07 31 23",115212.8,null,"2007 07 31 23",135489.20000000001]
["2007 08 31 23",154854.5,null,"2007 08 31 23",128930.5,null,"2007 08 31 23",119062.7,null,"2007 08 31 23",127181.8,null,"2007 08 31 23",107281.5,null,"2007 08 31 23",115720.2,null,"2007 08 31 23",118924.3,null,"2007 08 31 23",120712.7,null,"2007 08 31 23",105825.3,null,"2007 08 31 23",103015.1,null,"2007 08 31 23",132753.60000000001,null,"2007 08 31 23",120652.5,null,"2007 08 31 23",108399.8,null,"2007 08 31 23",108880,null,"2007 08 31 23",107782.7,null,"2007 08 31 23",122594.4,null,"2007 08 31 23",158528.79999999999,null,"2007 08 31 23",139566.39999999999,null,"2007 08 31 23",131021.3,null,"2007 08 31 23",119410.5]
["2007 09 30 23",84634.2,null,"2007 09 30 23",73179.5,null,"2007 09 30 23",78344.399999999994,null,"2007 09 30 23",77726,null,"2007 09 30 23",71367.600000000006,null,"2007 09 30 23",68461.7,null,"2007 09 30 23",91726.7,null,"2007 09 30 23",78504.399999999994,null,"2007 09 30 23",73182.5,null,"2007 09 30 23",53200.7,null,"2007 09 30 23",79197.100000000006,null,"2007 09 30 23",68314.899999999994,null,"2007 09 30 23",76632.7,null,"2007 09 30 23",60028.9,null,"2007 09 30 23",69751,null,"2007 09 30 23",75578.7,null,"2007 09 30 23",91242.3,null,"2007 09 30 23",77121.2,null,"2007 09 30 23",72934.7,null,"2007 09 30 23",67008.399999999994]
["2007 10 31 23",60239,null,"2007 10 31 23",36367.1,null,"2007 10 31 23",67745.600000000006,null,"2007 10 31 23",46089.7,null,"2007 10 31 23",72123.8,null,"2007 10 31 23",46274.400000000001,null,"2007 10 31 23",67193.399999999994,null,"2007 10 31 23",48518.9,null,"2007 10 31 23",60417.2,null,"2007 10 31 23",23751.5,null,"2007 10 31 23",64643.199999999997,null,"2007 10 31 23",35488.5,null,"2007 10 31 23",49644.9,null,"2007 10 31 23",24378.9,null,"2007 10 31 23",58655.5,null,"2007 10 31 23",50519.6,null,"2007 10 31 23",54889.4,null,"2007 10 31 23",37617.1,null,"2007 10 31 23",49215.1,null,"2007 10 31 23",32840.400000000001]
["2007 11 30 23",21391.5,null,"2007 11 30 23",10715.4,null,"2007 11 30 23",45171.4,null,"2007 11 30 23",20102.400000000001,null,"2007 11 30 23",30504.6,null,"2007 11 30 23",15109.4,null,"2007 11 30 23",32237.599999999999,null,"2007 11 30 23",18919.5,null,"2007 11 30 23",11859.5,null,"2007 11 30 23",2920.4,null,"2007 11 30 23",18978,null,"2007 11 30 23",9855.4,null,"2007 11 30 23",11442,null,"2007 11 30 23",4508.2,null,"2007 11 30 23",28476.7,null,"2007 11 30 23",20097.2,null,"2007 11 30 23",29824.7,null,"2007 11 30 23",13671.6,null,"2007 11 30 23",13009.2,null,"2007 11 30 23",7459.9]
["2007 12 31 23",21000.6,null,"2007 12 31 23",5128.7,null,"2007 12 31 23",7910,null,"2007 12 31 23",5653.2,null,"2007 12 31 23",799.8,null,"2007 12 31 23",3722.6,null,"2007 12 31 23",8682.2999999999993,null,"2007 12 31 23",6088.9,null,"2007 12 31 23",544.20000000000005,null,"2007 12 31 23",67.3,null,"2007 12 31 23",17731.5,null,"2007 12 31 23",3782,null,"2007 12 31 23",6109.6,null,"2007 12 31 23",736.1,null,"2007 12 31 23",7881.6,null,"2007 12 31 23",7060,null,"2007 12 31 23",12818.2,null,"2007 12 31 23",4965.6000000000004,null,"2007 12 31 23",9698.2000000000007,null,"2007 12 31 23",2356.3000000000002]
["2008 01 31 23",20372.7,null,"2008 01 31 23",7547.2,null,"2008 01 31 23",17611.599999999999,null,"2008 01 31 23",10182.200000000001,null,"2008 01 31 23",8524.2000000000007,null,"2008 01 31 23",8002.1,null,"2008 01 31 23",15312.7,null,"2008 01 31 23",10999.7,null,"2008 01 31 23",9930.1,null,"2008 01 31 23",1374.5,null,"2008 01 31 23",16498.3,null,"2008 01 31 23",6396.8,null,"2008 01 31 23",11913.9,null,"2008 01 31 23",2787,null,"2008 01 31 23",8767.6,null,"2008 01 31 23",10619.9,null,"2008 01 31 23",18163.8,null,"2008 01 31 23",9060.2999999999993,null,"2008 01 31 23",9913.5,null,"2008 01 31 23",4462.6000000000004]
["2008 02 29 23",57323.6,null,"2008 02 29 23",28542.9,null,"2008 02 29 23",31904.1,null,"2008 02 29 23",26314.5,null,"2008 02 29 23",38435.5,null,"2008 02 29 23",24784.5,null,"2008 02 29 23",49170.7,null,"2008 02 29 23",31143.599999999999,null,"2008 02 29 23",19240.2,null,"2008 02 29 23",9986.9,null,"2008 02 29 23",42827.7,null,"2008 02 29 23",23430.799999999999,null,"2008 02 29 23",27044,null,"2008 02 29 23",14542.1,null,"2008 02 29 23",38133.699999999997,null,"2008 02 29 23",29809.1,null,"2008 02 29 23",50808.9,null,"2008 02 29 23",27987.9,null,"2008 02 29 23",38478.9,null,"2008 02 29 23",20466.2]
["2008 03 31 23",72498.2,null,"2008 03 31 23",58990.6,null,"2008 03 31 23",75722.2,null,"2008 03 31 23",64941.5,null,"2008 03 31 23",81950.5,null,"2008 03 31 23",67261.600000000006,null,"2008 03 31 23",92873.600000000006,null,"2008 03 31 23",75294.2,null,"2008 03 31 23",91805.8,null,"2008 03 31 23",48099.5,null,"2008 03 31 23",70272.5,null,"2008 03 31 23",55515.199999999997,null,"2008 03 31 23",51120.2,null,"2008 03 31 23",41687.800000000003,null,"2008 03 31 23",72743.899999999994,null,"2008 03 31 23",71517.7,null,"2008 03 31 23",85670.2,null,"2008 03 31 23",65700.2,null,"2008 03 31 23",79485,null,"2008 03 31 23",59192.800000000003]
["2008 04 30 23",124816,null,"2008 04 30 23",104225,null,"2008 04 30 23",147017.5,null,"2008 04 30 23",125797.1,null,"2008 04 30 23",144098.6,null,"2008 04 30 23",125823.9,null,"2008 04 30 23",141159.4,null,"2008 04 30 23",123720.1,null,"2008 04 30 23",100424.2,null,"2008 04 30 23",89394,null,"2008 04 30 23",111968.9,null,"2008 04 30 23",94673.7,null,"2008 04 30 23",92894.8,null,"2008 04 30 23",92912.1,null,"2008 04 30 23",123260.6,null,"2008 04 30 23",125897.9,null,"2008 04 30 23",142046.9,null,"2008 04 30 23",122150.1,null,"2008 04 30 23",122773,null,"2008 04 30 23",98867.8]
["2008 05 31 23",181531.1,null,"2008 05 31 23",167219.5,null,"2008 05 31 23",227767.9,null,"2008 05 31 23",195146.8,null,"2008 05 31 23",211988.4,null,"2008 05 31 23",183974.6,null,"2008 05 31 23",199740.7,null,"2008 05 31 23",179794,null,"2008 05 31 23",130114.6,null,"2008 05 31 23",133266.70000000001,null,"2008 05 31 23",137829.79999999999,null,"2008 05 31 23",144102.1,null,"2008 05 31 23",179366.7,null,"2008 05 31 23",165650.9,null,"2008 05 31 23",241157.6,null,"2008 05 31 23",203471,null,"2008 05 31 23",226856.9,null,"2008 05 31 23",186913.7,null,"2008 05 31 23",144214.5,null,"2008 05 31 23",143593.29999999999]
["2008 06 30 23",172790.8,null,"2008 06 30 23",171774,null,"2008 06 30 23",178555.1,null,"2008 06 30 23",175489.7,null,"2008 06 30 23",177656.7,null,"2008 06 30 23",176099.9,null,"2008 06 30 23",197109.7,null,"2008 06 30 23",189088.5,null,"2008 06 30 23",99469,null,"2008 06 30 23",125010.5,null,"2008 06 30 23",166291.6,null,"2008 06 30 23",165882,null,"2008 06 30 23",159253.79999999999,null,"2008 06 30 23",161033.29999999999,null,"2008 06 30 23",186073,null,"2008 06 30 23",185420.9,null,"2008 06 30 23",234001.9,null,"2008 06 30 23",201102.7,null,"2008 06 30 23",173868.2,null,"2008 06 30 23",169559.3]
["2008 07 31 23",200485.7,null,"2008 07 31 23",178404.5,null,"2008 07 31 23",187265.2,null,"2008 07 31 23",175602.1,null,"2008 07 31 23",186311,null,"2008 07 31 23",171853.5,null,"2008 07 31 23",191339.5,null,"2008 07 31 23",176807.8,null,"2008 07 31 23",160849.29999999999,null,"2008 07 31 23",150427.79999999999,null,"2008 07 31 23",159211,null,"2008 07 31 23",160161.1,null,"2008 07 31 23",163369.9,null,"2008 07 31 23",158118,null,"2008 07 31 23",187283,null,"2008 07 31 23",181526.1,null,"2008 07 31 23",230234.8,null,"2008 07 31 23",195097.1,null,"2008 07 31 23",185811,null,"2008 07 31 23",169324.5]
["2008 08 31 23",74479.8,null,"2008 08 31 23",92488.7,null,"2008 08 31 23",103941.5,null,"2008 08 31 23",112064.1,null,"2008 08 31 23",82497.100000000006,null,"2008 08 31 23",100721.4,null,"2008 08 31 23",87738.3,null,"2008 08 31 23",106283.7,null,"2008 08 31 23",78632.399999999994,null,"2008 08 31 23",91724,null,"2008 08 31 23",68951.899999999994,null,"2008 08 31 23",90908.2,null,"2008 08 31 23",96043.4,null,"2008 08 31 23",101856.2,null,"2008 08 31 23",88104.9,null,"2008 08 31 23",111177.8,null,"2008 08 31 23",90458.2,null,"2008 08 31 23",107786.7,null,"2008 08 31 23",86031,null,"2008 08 31 23",97764.3]
["2008 09 30 23",64587.6,null,"2008 09 30 23",62920.7,null,"2008 09 30 23",74437.399999999994,null,"2008 09 30 23",76143.7,null,"2008 09 30 23",54902.400000000001,null,"2008 09 30 23",64952.7,null,"2008 09 30 23",67142.7,null,"2008 09 30 23",72588.399999999994,null,"2008 09 30 23",92950.5,null,"2008 09 30 23",62342.1,null,"2008 09 30 23",64106,null,"2008 09 30 23",63789.599999999999,null,"2008 09 30 23",71689.899999999994,null,"2008 09 30 23",64297.5,null,"2008 09 30 23",83925.4,null,"2008 09 30 23",87445.2,null,"2008 09 30 23",74317.600000000006,null,"2008 09 30 23",69718.5,null,"2008 09 30 23",70767.399999999994,null,"2008 09 30 23",64986.400000000001]
["2008 10 31 23",57100.7,null,"2008 10 31 23",33020.800000000003,null,"2008 10 31 23",61472.3,null,"2008 10 31 23",43122,null,"2008 10 31 23",44757.2,null,"2008 10 31 23",37555.9,null,"2008 10 31 23",51509.599999999999,null,"2008 10 31 23",43550,null,"2008 10 31 23",32109.1,null,"2008 10 31 23",18624.099999999999,null,"2008 10 31 23",44537.1,null,"2008 10 31 23",30131.9,null,"2008 10 31 23",50748.1,null,"2008 10 31 23",25398.7,null,"2008 10 31 23",57515.4,null,"2008 10 31 23",46762,null,"2008 10 31 23",61510.5,null,"2008 10 31 23",38147.4,null,"2008 10 31 23",49124.1,null,"2008 10 31 23",29216.2]
["2008 11 30 23",31907.8,null,"2008 11 30 23",12184.5,null,"2008 11 30 23",40840.199999999997,null,"2008 11 30 23",17437.5,null,"2008 11 30 23",34635.4,null,"2008 11 30 23",16080.6,null,"2008 11 30 23",30195.9,null,"2008 11 30 23",17074.099999999999,null,"2008 11 30 23",20880.400000000001,null,"2008 11 30 23",3634.7,null,"2008 11 30 23",26565.1,null,"2008 11 30 23",10720.7,null,"2008 11 30 23",20302.099999999999,null,"2008 11 30 23",5669.9,null,"2008 11 30 23",18724.3,null,"2008 11 30 23",16441.2,null,"2008 11 30 23",29746.1,null,"2008 11 30 23",13117,null,"2008 11 30 23",16199,null,"2008 11 30 23",8279.7000000000007]
["2008 12 31 23",17831.7,null,"2008 12 31 23",4189.8999999999996,null,"2008 12 31 23",11610.5,null,"2008 12 31 23",6712,null,"2008 12 31 23",9110.9,null,"2008 12 31 23",4911.5,null,"2008 12 31 23",14825.9,null,"2008 12 31 23",7435.2,null,"2008 12 31 23",713.9,null,"2008 12 31 23",88.6,null,"2008 12 31 23",14384.7,null,"2008 12 31 23",3133.6,null,"2008 12 31 23",2826.3,null,"2008 12 31 23",601.79999999999995,null,"2008 12 31 23",12648.2,null,"2008 12 31 23",9405.4,null,"2008 12 31 23",15319.7,null,"2008 12 31 23",5508.6,null,"2008 12 31 23",5550.4,null,"2008 12 31 23",2037.6]
["2009 01 31 23",23089.7,null,"2009 01 31 23",7057.9,null,"2009 01 31 23",22847.599999999999,null,"2009 01 31 23",10164.799999999999,null,"2009 01 31 23",19199.099999999999,null,"2009 01 31 23",9234.7000000000007,null,"2009 01 31 23",21788.2,null,"2009 01 31 23",11201.3,null,"2009 01 31 23",3866.8,null,"2009 01 31 23",935.5,null,"2009 01 31 23",14976.2,null,"2009 01 31 23",5727.6,null,"2009 01 31 23",8664.2999999999993,null,"2009 01 31 23",2071.6999999999998,null,"2009 01 31 23",19345.2,null,"2009 01 31 23",13295.6,null,"2009 01 31 23",26353.8,null,"2009 01 31 23",8935.7999999999993,null,"2009 01 31 23",11268.8,null,"2009 01 31 23",4301]
["2009 02 28 23",27880.6,null,"2009 02 28 23",20058.7,null,"2009 02 28 23",35287.9,null,"2009 02 28 23",25503.5,null,"2009 02 28 23",32792.6,null,"2009 02 28 23",23918.9,null,"2009 02 28 23",38241.699999999997,null,"2009 02 28 23",26070.3,null,"2009 02 28 23",32022.7,null,"2009 02 28 23",12627.8,null,"2009 02 28 23",54704.9,null,"2009 02 28 23",23405.7,null,"2009 02 28 23",41314.5,null,"2009 02 28 23",16854.900000000001,null,"2009 02 28 23",31219.9,null,"2009 02 28 23",28047.1,null,"2009 02 28 23",32397.1,null,"2009 02 28 23",23452.2,null,"2009 02 28 23",42559.9,null,"2009 02 28 23",19597.2]
["2009 03 31 23",48844,null,"2009 03 31 23",50341.4,null,"2009 03 31 23",77275,null,"2009 03 31 23",62928.1,null,"2009 03 31 23",57602,null,"2009 03 31 23",54640.4,null,"2009 03 31 23",45917.3,null,"2009 03 31 23",55974.9,null,"2009 03 31 23",79732,null,"2009 03 31 23",48755.5,null,"2009 03 31 23",56759.3,null,"2009 03 31 23",51464.9,null,"2009 03 31 23",69380.100000000006,null,"2009 03 31 23",49611.3,null,"2009 03 31 23",54753.7,null,"2009 03 31 23",62675.199999999997,null,"2009 03 31 23",52923.6,null,"2009 03 31 23",53558.5,null,"2009 03 31 23",72620.2,null,"2009 03 31 23",55750.400000000001]
["2009 04 30 23",138706.4,null,"2009 04 30 23",117525.2,null,"2009 04 30 23",174161.1,null,"2009 04 30 23",136303.1,null,"2009 04 30 23",201139.7,null,"2009 04 30 23",145800.70000000001,null,"2009 04 30 23",210986.9,null,"2009 04 30 23",156266.70000000001,null,"2009 04 30 23",119284.6,null,"2009 04 30 23",95241.600000000006,null,"2009 04 30 23",117071.9,null,"2009 04 30 23",105605.2,null,"2009 04 30 23",131191.79999999999,null,"2009 04 30 23",103890,null,"2009 04 30 23",198226.6,null,"2009 04 30 23",157886,null,"2009 04 30 23",179783.4,null,"2009 04 30 23",137932.9,null,"2009 04 30 23",105228.5,null,"2009 04 30 23",97465.1]
["2009 05 31 23",168606,null,"2009 05 31 23",160587.1,null,"2009 05 31 23",187032.8,null,"2009 05 31 23",173654.2,null,"2009 05 31 23",170875.4,null,"2009 05 31 23",165322,null,"2009 05 31 23",188496.7,null,"2009 05 31 23",175959.3,null,"2009 05 31 23",168726.8,null,"2009 05 31 23",145991.1,null,"2009 05 31 23",145396.79999999999,null,"2009 05 31 23",151088.79999999999,null,"2009 05 31 23",184392.3,null,"2009 05 31 23",159690.20000000001,null,"2009 05 31 23",163563.9,null,"2009 05 31 23",168601.1,null,"2009 05 31 23",210142.8,null,"2009 05 31 23",180200.9,null,"2009 05 31 23",169128.7,null,"2009 05 31 23",155771.1]
["2009 06 30 23",153677.6,null,"2009 06 30 23",151541.20000000001,null,"2009 06 30 23",197111.5,null,"2009 06 30 23",180669.1,null,"2009 06 30 23",163071.79999999999,null,"2009 06 30 23",160825.5,null,"2009 06 30 23",203256.9,null,"2009 06 30 23",181328.6,null,"2009 06 30 23",163566.70000000001,null,"2009 06 30 23",160280.5,null,"2009 06 30 23",128633.9,null,"2009 06 30 23",141355.9,null,"2009 06 30 23",179967.8,null,"2009 06 30 23",169590.8,null,"2009 06 30 23",145427.6,null,"2009 06 30 23",161194.1,null,"2009 06 30 23",187553.4,null,"2009 06 30 23",161519.79999999999,null,"2009 06 30 23",142222.20000000001,null,"2009 06 30 23",155986.20000000001]
["2009 07 31 23",107159.6,null,"2009 07 31 23",118021.4,null,"2009 07 31 23",101106,null,"2009 07 31 23",121221.1,null,"2009 07 31 23",90917.8,null,"2009 07 31 23",112781.7,null,"2009 07 31 23",133343.70000000001,null,"2009 07 31 23",141935.70000000001,null,"2009 07 31 23",87585.1,null,"2009 07 31 23",114694.5,null,"2009 07 31 23",79767.7,null,"2009 07 31 23",105808,null,"2009 07 31 23",128683.2,null,"2009 07 31 23",137645.4,null,"2009 07 31 23",123528.3,null,"2009 07 31 23",136454.70000000001,null,"2009 07 31 23",159847.79999999999,null,"2009 07 31 23",139994.70000000001,null,"2009 07 31 23",109517.4,null,"2009 07 31 23",122632]
["2009 08 31 23",134302.9,null,"2009 08 31 23",122289.1,null,"2009 08 31 23",124660.8,null,"2009 08 31 23",119332.6,null,"2009 08 31 23",134328.1,null,"2009 08 31 23",124678.39999999999,null,"2009 08 31 23",168042,null,"2009 08 31 23",143002.79999999999,null,"2009 08 31 23",105067.1,null,"2009 08 31 23",101098.6,null,"2009 08 31 23",86399.1,null,"2009 08 31 23",101310.9,null,"2009 08 31 23",141471.5,null,"2009 08 31 23",120255,null,"2009 08 31 23",140646,null,"2009 08 31 23",132295.20000000001,null,"2009 08 31 23",190541.3,null,"2009 08 31 23",136979.79999999999,null,"2009 08 31 23",99313.9,null,"2009 08 31 23",108300.7]
["2009 09 30 23",100298.7,null,"2009 09 30 23",78725.399999999994,null,"2009 09 30 23",90903.9,null,"2009 09 30 23",77287.8,null,"2009 09 30 23",94027.4,null,"2009 09 30 23",77458.7,null,"2009 09 30 23",99469.6,null,"2009 09 30 23",80515.199999999997,null,"2009 09 30 23",77562.7,null,"2009 09 30 23",59813.7,null,"2009 09 30 23",74827.199999999997,null,"2009 09 30 23",71566.399999999994,null,"2009 09 30 23",87611.5,null,"2009 09 30 23",65759.3,null,"2009 09 30 23",91199.2,null,"2009 09 30 23",78380.3,null,"2009 09 30 23",135731.70000000001,null,"2009 09 30 23",90516,null,"2009 09 30 23",70783,null,"2009 09 30 23",68677.100000000006]
["2009 10 31 23",56786.400000000001,null,"2009 10 31 23",34825.5,null,"2009 10 31 23",53361.3,null,"2009 10 31 23",38322.1,null,"2009 10 31 23",39201.4,null,"2009 10 31 23",33627.4,null,"2009 10 31 23",40355.199999999997,null,"2009 10 31 23",34669.199999999997,null,"2009 10 31 23",53087.5,null,"2009 10 31 23",23444.9,null,"2009 10 31 23",57181.7,null,"2009 10 31 23",33300.300000000003,null,"2009 10 31 23",65738.100000000006,null,"2009 10 31 23",27997.599999999999,null,"2009 10 31 23",47876.4,null,"2009 10 31 23",40683.699999999997,null,"2009 10 31 23",59006.9,null,"2009 10 31 23",38087.800000000003,null,"2009 10 31 23",45957.2,null,"2009 10 31 23",30385.9]
["2009 11 30 23",6319.8,null,"2009 11 30 23",6610.1,null,"2009 11 30 23",5540.3,null,"2009 11 30 23",9120.9,null,"2009 11 30 23",7406.7,null,"2009 11 30 23",9319.4,null,"2009 11 30 23",12395.6,null,"2009 11 30 23",12022.1,null,"2009 11 30 23",4384.3,null,"2009 11 30 23",1943.4,null,"2009 11 30 23",9417.4,null,"2009 11 30 23",6071.9,null,"2009 11 30 23",5832.7,null,"2009 11 30 23",2826.7,null,"2009 11 30 23",12073.9,null,"2009 11 30 23",12943.9,null,"2009 11 30 23",8480.1,null,"2009 11 30 23",8330.5,null,"2009 11 30 23",6450.2,null,"2009 11 30 23",4592.2]
["2009 12 31 23",10074.4,null,"2009 12 31 23",4139.7,null,"2009 12 31 23",20434.400000000001,null,"2009 12 31 23",8046,null,"2009 12 31 23",15965.9,null,"2009 12 31 23",7104.8,null,"2009 12 31 23",16245.6,null,"2009 12 31 23",8494.9,null,"2009 12 31 23",894.3,null,"2009 12 31 23",102.3,null,"2009 12 31 23",10212.5,null,"2009 12 31 23",3148.1,null,"2009 12 31 23",2854.7,null,"2009 12 31 23",633.5,null,"2009 12 31 23",8412.7999999999993,null,"2009 12 31 23",8731.2000000000007,null,"2009 12 31 23",6430.5,null,"2009 12 31 23",4500.2,null,"2009 12 31 23",6199.3,null,"2009 12 31 23",2099.6999999999998]
["2010 01 31 23",17437.3,null,"2010 01 31 23",7081.1,null,"2010 01 31 23",34779.599999999999,null,"2010 01 31 23",13994.5,null,"2010 01 31 23",12655.4,null,"2010 01 31 23",10419.700000000001,null,"2010 01 31 23",9990,null,"2010 01 31 23",10207.6,null,"2010 01 31 23",2966.5,null,"2010 01 31 23",1137.3,null,"2010 01 31 23",21858.799999999999,null,"2010 01 31 23",6771.7,null,"2010 01 31 23",4398,null,"2010 01 31 23",1845.4,null,"2010 01 31 23",25184,null,"2010 01 31 23",14538.9,null,"2010 01 31 23",8293.1,null,"2010 01 31 23",7929.4,null,"2010 01 31 23",12694.2,null,"2010 01 31 23",5067.3999999999996]
["2010 02 28 23",24178.2,null,"2010 02 28 23",16555.7,null,"2010 02 28 23",10926.6,null,"2010 02 28 23",16985.2,null,"2010 02 28 23",9952.9,null,"2010 02 28 23",13833.6,null,"2010 02 28 23",9155.7000000000007,null,"2010 02 28 23",13929.5,null,"2010 02 28 23",27328,null,"2010 02 28 23",12379.6,null,"2010 02 28 23",33012,null,"2010 02 28 23",18395.3,null,"2010 02 28 23",39646,null,"2010 02 28 23",16203.3,null,"2010 02 28 23",9206.7000000000007,null,"2010 02 28 23",16037.7,null,"2010 02 28 23",14766.8,null,"2010 02 28 23",15107,null,"2010 02 28 23",24305.200000000001,null,"2010 02 28 23",16317]
["2010 03 31 23",74437,null,"2010 03 31 23",54165.9,null,"2010 03 31 23",82568.100000000006,null,"2010 03 31 23",59496.7,null,"2010 03 31 23",103366.6,null,"2010 03 31 23",65820,null,"2010 03 31 23",97949.6,null,"2010 03 31 23",71080.600000000006,null,"2010 03 31 23",94994.2,null,"2010 03 31 23",50297.599999999999,null,"2010 03 31 23",71389,null,"2010 03 31 23",54428.2,null,"2010 03 31 23",81474.8,null,"2010 03 31 23",50784.3,null,"2010 03 31 23",67212.899999999994,null,"2010 03 31 23",57305.599999999999,null,"2010 03 31 23",89442.6,null,"2010 03 31 23",61953.3,null,"2010 03 31 23",68155.8,null,"2010 03 31 23",52369.2]
["2010 04 30 23",114500.1,null,"2010 04 30 23",99829.8,null,"2010 04 30 23",128612.9,null,"2010 04 30 23",107504.8,null,"2010 04 30 23",111325.3,null,"2010 04 30 23",99453,null,"2010 04 30 23",119778.8,null,"2010 04 30 23",105070.39999999999,null,"2010 04 30 23",112944.4,null,"2010 04 30 23",97743.7,null,"2010 04 30 23",109254.9,null,"2010 04 30 23",100072.8,null,"2010 04 30 23",91169.5,null,"2010 04 30 23",86488.2,null,"2010 04 30 23",122825.60000000001,null,"2010 04 30 23",106757.5,null,"2010 04 30 23",126819.7,null,"2010 04 30 23",105986.6,null,"2010 04 30 23",103305.2,null,"2010 04 30 23",102132]
["2010 05 31 23",123152.6,null,"2010 05 31 23",121338.5,null,"2010 05 31 23",114922.5,null,"2010 05 31 23",122226.8,null,"2010 05 31 23",93380.6,null,"2010 05 31 23",103564,null,"2010 05 31 23",90182.9,null,"2010 05 31 23",108196,null,"2010 05 31 23",110645.6,null,"2010 05 31 23",116896.4,null,"2010 05 31 23",100289.8,null,"2010 05 31 23",110776.3,null,"2010 05 31 23",168533.8,null,"2010 05 31 23",136134.5,null,"2010 05 31 23",39324.199999999997,null,"2010 05 31 23",96350.8,null,"2010 05 31 23",181758,null,"2010 05 31 23",142654.20000000001,null,"2010 05 31 23",101924.1,null,"2010 05 31 23",116519.8]
["2010 06 30 23",164675.5,null,"2010 06 30 23",152366,null,"2010 06 30 23",157118.9,null,"2010 06 30 23",149862.9,null,"2010 06 30 23",172453.7,null,"2010 06 30 23",157256.9,null,"2010 06 30 23",199082.9,null,"2010 06 30 23",172405.5,null,"2010 06 30 23",119103.7,null,"2010 06 30 23",144273.29999999999,null,"2010 06 30 23",128315.2,null,"2010 06 30 23",146214.5,null,"2010 06 30 23",147293.20000000001,null,"2010 06 30 23",138788.4,null,"2010 06 30 23",167144.1,null,"2010 06 30 23",149688.70000000001,null,"2010 06 30 23",232195.8,null,"2010 06 30 23",172782.2,null,"2010 06 30 23",123577,null,"2010 06 30 23",146578.29999999999]
["2010 07 31 23",179801.2,null,"2010 07 31 23",156420.79999999999,null,"2010 07 31 23",164386.5,null,"2010 07 31 23",149052.70000000001,null,"2010 07 31 23",173855,null,"2010 07 31 23",146895.79999999999,null,"2010 07 31 23",227382.9,null,"2010 07 31 23",172758.3,null,"2010 07 31 23",104966.2,null,"2010 07 31 23",112622.5,null,"2010 07 31 23",145089.79999999999,null,"2010 07 31 23",141148.1,null,"2010 07 31 23",155963.29999999999,null,"2010 07 31 23",131669.29999999999,null,"2010 07 31 23",207049.2,null,"2010 07 31 23",169324.9,null,"2010 07 31 23",237361.6,null,"2010 07 31 23",165411.20000000001,null,"2010 07 31 23",133066.20000000001,null,"2010 07 31 23",145959.1]
["2010 08 31 23",71743.3,null,"2010 08 31 23",82569,null,"2010 08 31 23",70631.899999999994,null,"2010 08 31 23",93835.9,null,"2010 08 31 23",46352.9,null,"2010 08 31 23",82118.100000000006,null,"2010 08 31 23",97630.3,null,"2010 08 31 23",104061.6,null,"2010 08 31 23",76039.100000000006,null,"2010 08 31 23",81534.3,null,"2010 08 31 23",58015.7,null,"2010 08 31 23",71103.399999999994,null,"2010 08 31 23",89138.8,null,"2010 08 31 23",87745.3,null,"2010 08 31 23",73706.2,null,"2010 08 31 23",93901.5,null,"2010 08 31 23",105044.7,null,"2010 08 31 23",98978.3,null,"2010 08 31 23",81880.3,null,"2010 08 31 23",87977.8]
["2010 09 30 23",68318.100000000006,null,"2010 09 30 23",63442.8,null,"2010 09 30 23",75914.100000000006,null,"2010 09 30 23",71712.399999999994,null,"2010 09 30 23",66040.800000000003,null,"2010 09 30 23",66315.600000000006,null,"2010 09 30 23",82780.5,null,"2010 09 30 23",69517.8,null,"2010 09 30 23",74860.100000000006,null,"2010 09 30 23",53410.1,null,"2010 09 30 23",69956.2,null,"2010 09 30 23",62517.3,null,"2010 09 30 23",91975.1,null,"2010 09 30 23",63989.5,null,"2010 09 30 23",80100.399999999994,null,"2010 09 30 23",69412.399999999994,null,"2010 09 30 23",84555.6,null,"2010 09 30 23",71922.3,null,"2010 09 30 23",84208.2,null,"2010 09 30 23",65547.600000000006]
["2010 10 31 23",60186.5,null,"2010 10 31 23",36347.1,null,"2010 10 31 23",51905.1,null,"2010 10 31 23",39203,null,"2010 10 31 23",66734.5,null,"2010 10 31 23",43683.9,null,"2010 10 31 23",77616.7,null,"2010 10 31 23",48762,null,"2010 10 31 23",38109.199999999997,null,"2010 10 31 23",20216.5,null,"2010 10 31 23",58988.5,null,"2010 10 31 23",34975.4,null,"2010 10 31 23",31609.3,null,"2010 10 31 23",23387.200000000001,null,"2010 10 31 23",67718.399999999994,null,"2010 10 31 23",46016.4,null,"2010 10 31 23",71069.100000000006,null,"2010 10 31 23",43017.599999999999,null,"2010 10 31 23",51851.8,null,"2010 10 31 23",31624.400000000001]
["2010 11 30 23",24317.599999999999,null,"2010 11 30 23",10437.200000000001,null,"2010 11 30 23",25158.6,null,"2010 11 30 23",15042.8,null,"2010 11 30 23",24127.5,null,"2010 11 30 23",13748.1,null,"2010 11 30 23",11158.2,null,"2010 11 30 23",12653.3,null,"2010 11 30 23",9045.9,null,"2010 11 30 23",2616.5,null,"2010 11 30 23",23604.9,null,"2010 11 30 23",9468.2000000000007,null,"2010 11 30 23",21221.200000000001,null,"2010 11 30 23",4968.2,null,"2010 11 30 23",13106.9,null,"2010 11 30 23",15174.4,null,"2010 11 30 23",29965.599999999999,null,"2010 11 30 23",12546.6,null,"2010 11 30 23",13551.7,null,"2010 11 30 23",7300.6]
["2010 12 31 23",11847.6,null,"2010 12 31 23",4446.5,null,"2010 12 31 23",28110.9,null,"2010 12 31 23",10440.1,null,"2010 12 31 23",14019.6,null,"2010 12 31 23",7029.5,null,"2010 12 31 23",15036.2,null,"2010 12 31 23",8551.6,null,"2010 12 31 23",433.5,null,"2010 12 31 23",86.7,null,"2010 12 31 23",14431.9,null,"2010 12 31 23",3723.4,null,"2010 12 31 23",6280,null,"2010 12 31 23",820.8,null,"2010 12 31 23",19721.2,null,"2010 12 31 23",11462.4,null,"2010 12 31 23",15804.9,null,"2010 12 31 23",5868.2,null,"2010 12 31 23",7171.1,null,"2010 12 31 23",2330.8000000000002]
["2011 01 31 23",20464.3,null,"2011 01 31 23",8830.4,null,"2011 01 31 23",27601.8,null,"2011 01 31 23",12502.5,null,"2011 01 31 23",22335.8,null,"2011 01 31 23",11553.5,null,"2011 01 31 23",28224.400000000001,null,"2011 01 31 23",13477,null,"2011 01 31 23",5915.8,null,"2011 01 31 23",1201.9000000000001,null,"2011 01 31 23",17436.2,null,"2011 01 31 23",6993.5,null,"2011 01 31 23",7754,null,"2011 01 31 23",2501.3000000000002,null,"2011 01 31 23",23393.7,null,"2011 01 31 23",13135.7,null,"2011 01 31 23",25932.2,null,"2011 01 31 23",10140.1,null,"2011 01 31 23",10827.9,null,"2011 01 31 23",5162.3999999999996]
["2011 02 28 23",28847,null,"2011 02 28 23",22912.400000000001,null,"2011 02 28 23",34930.300000000003,null,"2011 02 28 23",28208.7,null,"2011 02 28 23",41463.9,null,"2011 02 28 23",28168.6,null,"2011 02 28 23",24999.3,null,"2011 02 28 23",24624.7,null,"2011 02 28 23",32354.9,null,"2011 02 28 23",13073,null,"2011 02 28 23",33209.800000000003,null,"2011 02 28 23",20342.2,null,"2011 02 28 23",39918.199999999997,null,"2011 02 28 23",16886.5,null,"2011 02 28 23",17895.400000000001,null,"2011 02 28 23",27669.7,null,"2011 02 28 23",36246.199999999997,null,"2011 02 28 23",24862.9,null,"2011 02 28 23",41702,null,"2011 02 28 23",20809.5]
["2011 03 31 23",104723.4,null,"2011 03 31 23",69790.5,null,"2011 03 31 23",75282.7,null,"2011 03 31 23",60048.3,null,"2011 03 31 23",90500.9,null,"2011 03 31 23",68367.199999999997,null,"2011 03 31 23",77932.5,null,"2011 03 31 23",69427.3,null,"2011 03 31 23",61913.2,null,"2011 03 31 23",50666.8,null,"2011 03 31 23",96114.2,null,"2011 03 31 23",63967.5,null,"2011 03 31 23",98309.1,null,"2011 03 31 23",60219.5,null,"2011 03 31 23",67437,null,"2011 03 31 23",64533.2,null,"2011 03 31 23",127534.7,null,"2011 03 31 23",75087.5,null,"2011 03 31 23",72589.7,null,"2011 03 31 23",57997.5]
["2011 04 30 23",130785.60000000001,null,"2011 04 30 23",113976,null,"2011 04 30 23",144951.9,null,"2011 04 30 23",119794.4,null,"2011 04 30 23",145283.5,null,"2011 04 30 23",120933,null,"2011 04 30 23",151826.29999999999,null,"2011 04 30 23",128419.2,null,"2011 04 30 23",111515.1,null,"2011 04 30 23",100642.9,null,"2011 04 30 23",108453.9,null,"2011 04 30 23",104118.5,null,"2011 04 30 23",119166.5,null,"2011 04 30 23",103372.6,null,"2011 04 30 23",150902.39999999999,null,"2011 04 30 23",130167.8,null,"2011 04 30 23",156321,null,"2011 04 30 23",122238,null,"2011 04 30 23",92694.5,null,"2011 04 30 23",98863.4]
["2011 05 31 23",152417.29999999999,null,"2011 05 31 23",151251.4,null,"2011 05 31 23",141410.20000000001,null,"2011 05 31 23",156815.4,null,"2011 05 31 23",163936.1,null,"2011 05 31 23",167984.2,null,"2011 05 31 23",189748.3,null,"2011 05 31 23",180992.8,null,"2011 05 31 23",78065.600000000006,null,"2011 05 31 23",105981.7,null,"2011 05 31 23",101635,null,"2011 05 31 23",126323.8,null,"2011 05 31 23",120137.3,null,"2011 05 31 23",134638.20000000001,null,"2011 05 31 23",158124.70000000001,null,"2011 05 31 23",166496.4,null,"2011 05 31 23",196110.2,null,"2011 05 31 23",171476.3,null,"2011 05 31 23",94311.5,null,"2011 05 31 23",126655.8]
["2011 06 30 23",152480.70000000001,null,"2011 06 30 23",154032.1,null,"2011 06 30 23",143576.1,null,"2011 06 30 23",159874,null,"2011 06 30 23",142357.9,null,"2011 06 30 23",153965,null,"2011 06 30 23",163892.20000000001,null,"2011 06 30 23",171779.5,null,"2011 06 30 23",127045,null,"2011 06 30 23",139312.29999999999,null,"2011 06 30 23",120570.5,null,"2011 06 30 23",143998,null,"2011 06 30 23",215820.7,null,"2011 06 30 23",178884.7,null,"2011 06 30 23",175884.5,null,"2011 06 30 23",182140.4,null,"2011 06 30 23",205238,null,"2011 06 30 23",182317.3,null,"2011 06 30 23",109269.2,null,"2011 06 30 23",140069.5]
["2011 07 31 23",96371.9,null,"2011 07 31 23",124044,null,"2011 07 31 23",95523.5,null,"2011 07 31 23",134248,null,"2011 07 31 23",73690.600000000006,null,"2011 07 31 23",119679.7,null,"2011 07 31 23",93354.9,null,"2011 07 31 23",124324.1,null,"2011 07 31 23",98537.1,null,"2011 07 31 23",127965.8,null,"2011 07 31 23",96801,null,"2011 07 31 23",129275.1,null,"2011 07 31 23",189214.2,null,"2011 07 31 23",174653.8,null,"2011 07 31 23",98660.3,null,"2011 07 31 23",126525.2,null,"2011 07 31 23",151726.79999999999,null,"2011 07 31 23",156572.20000000001,null,"2011 07 31 23",113037.1,null,"2011 07 31 23",134652.29999999999]
["2011 08 31 23",117597.5,null,"2011 08 31 23",115673.8,null,"2011 08 31 23",83691.7,null,"2011 08 31 23",108330.4,null,"2011 08 31 23",96359.4,null,"2011 08 31 23",107301.5,null,"2011 08 31 23",107189.3,null,"2011 08 31 23",118315.5,null,"2011 08 31 23",63899.4,null,"2011 08 31 23",82670.7,null,"2011 08 31 23",98079.4,null,"2011 08 31 23",107823.6,null,"2011 08 31 23",105285.9,null,"2011 08 31 23",102158.8,null,"2011 08 31 23",78780.7,null,"2011 08 31 23",106959.2,null,"2011 08 31 23",133618.70000000001,null,"2011 08 31 23",127037,null,"2011 08 31 23",76627.3,null,"2011 08 31 23",97154]
["2011 09 30 23",79428.3,null,"2011 09 30 23",70034,null,"2011 09 30 23",54389.9,null,"2011 09 30 23",67127.3,null,"2011 09 30 23",67496.3,null,"2011 09 30 23",71797.100000000006,null,"2011 09 30 23",82919.399999999994,null,"2011 09 30 23",84147,null,"2011 09 30 23",32925.199999999997,null,"2011 09 30 23",37072.6,null,"2011 09 30 23",63704,null,"2011 09 30 23",62499.5,null,"2011 09 30 23",34766.400000000001,null,"2011 09 30 23",40408,null,"2011 09 30 23",75312.800000000003,null,"2011 09 30 23",81932.899999999994,null,"2011 09 30 23",102338.1,null,"2011 09 30 23",81127.100000000006,null,"2011 09 30 23",40653.599999999999,null,"2011 09 30 23",52731]
["2011 10 31 23",70472.899999999994,null,"2011 10 31 23",39607.1,null,"2011 10 31 23",54387.9,null,"2011 10 31 23",39997,null,"2011 10 31 23",58132.3,null,"2011 10 31 23",41574.5,null,"2011 10 31 23",83613.8,null,"2011 10 31 23",50371,null,"2011 10 31 23",24883.8,null,"2011 10 31 23",18416.3,null,"2011 10 31 23",71625.399999999994,null,"2011 10 31 23",40085.800000000003,null,"2011 10 31 23",41966.3,null,"2011 10 31 23",23722.3,null,"2011 10 31 23",78817.2,null,"2011 10 31 23",51565.9,null,"2011 10 31 23",81175.600000000006,null,"2011 10 31 23",44489.599999999999,null,"2011 10 31 23",49147.199999999997,null,"2011 10 31 23",34484]
["2011 11 30 23",27649.200000000001,null,"2011 11 30 23",10666.3,null,"2011 11 30 23",20874.099999999999,null,"2011 11 30 23",12769.1,null,"2011 11 30 23",22998.7,null,"2011 11 30 23",13162.6,null,"2011 11 30 23",21429.7,null,"2011 11 30 23",13514.3,null,"2011 11 30 23",7596.2,null,"2011 11 30 23",2594.1,null,"2011 11 30 23",27249.4,null,"2011 11 30 23",10186.9,null,"2011 11 30 23",12163,null,"2011 11 30 23",4936.5,null,"2011 11 30 23",29192,null,"2011 11 30 23",18279.5,null,"2011 11 30 23",27729,null,"2011 11 30 23",11447.2,null,"2011 11 30 23",20927.7,null,"2011 11 30 23",8088.6]
["2011 12 31 23",22276.1,null,"2011 12 31 23",5007.8,null,"2011 12 31 23",16191.5,null,"2011 12 31 23",7950.1,null,"2011 12 31 23",15529.3,null,"2011 12 31 23",7667.8,null,"2011 12 31 23",17117.400000000001,null,"2011 12 31 23",9400.4,null,"2011 12 31 23",243.2,null,"2011 12 31 23",73.8,null,"2011 12 31 23",16023.7,null,"2011 12 31 23",3569.7,null,"2011 12 31 23",3061,null,"2011 12 31 23",611.20000000000005,null,"2011 12 31 23",11081.4,null,"2011 12 31 23",9558.7999999999993,null,"2011 12 31 23",23283.1,null,"2011 12 31 23",6967.2,null,"2011 12 31 23",6999.5,null,"2011 12 31 23",1972.6]
["2012 01 31 23",22003.1,null,"2012 01 31 23",8413.9,null,"2012 01 31 23",27616.6,null,"2012 01 31 23",13255.5,null,"2012 01 31 23",19786.099999999999,null,"2012 01 31 23",10923.1,null,"2012 01 31 23",15929.2,null,"2012 01 31 23",11468.1,null,"2012 01 31 23",4554.1000000000004,null,"2012 01 31 23",1213.0999999999999,null,"2012 01 31 23",14844.9,null,"2012 01 31 23",5826.1,null,"2012 01 31 23",2639.9,null,"2012 01 31 23",1477.1,null,"2012 01 31 23",32489.3,null,"2012 01 31 23",15768.4,null,"2012 01 31 23",16645.3,null,"2012 01 31 23",8829.7999999999993,null,"2012 01 31 23",11034.8,null,"2012 01 31 23",4659.5]
["2012 02 29 23",43897.7,null,"2012 02 29 23",26380.5,null,"2012 02 29 23",61505,null,"2012 02 29 23",31476.799999999999,null,"2012 02 29 23",50271.5,null,"2012 02 29 23",30485.200000000001,null,"2012 02 29 23",49382,null,"2012 02 29 23",32558.3,null,"2012 02 29 23",35507.599999999999,null,"2012 02 29 23",14196.9,null,"2012 02 29 23",47362.5,null,"2012 02 29 23",25161.5,null,"2012 02 29 23",36950.699999999997,null,"2012 02 29 23",17217.400000000001,null,"2012 02 29 23",50051.7,null,"2012 02 29 23",33020.199999999997,null,"2012 02 29 23",44247.5,null,"2012 02 29 23",27302.400000000001,null,"2012 02 29 23",41460.699999999997,null,"2012 02 29 23",22503.8]
["2012 03 31 23",99623.8,null,"2012 03 31 23",67411,null,"2012 03 31 23",93283.6,null,"2012 03 31 23",75577.7,null,"2012 03 31 23",118718.7,null,"2012 03 31 23",82082.7,null,"2012 03 31 23",126060.1,null,"2012 03 31 23",86102.399999999994,null,"2012 03 31 23",82038.100000000006,null,"2012 03 31 23",50425.3,null,"2012 03 31 23",74538.8,null,"2012 03 31 23",58908.5,null,"2012 03 31 23",85315.7,null,"2012 03 31 23",53544.6,null,"2012 03 31 23",94926.7,null,"2012 03 31 23",77399.600000000006,null,"2012 03 31 23",95754.1,null,"2012 03 31 23",67336.7,null,"2012 03 31 23",61746.5,null,"2012 03 31 23",52900.800000000003]
["2012 04 30 23",85333.6,null,"2012 04 30 23",92823.6,null,"2012 04 30 23",83717.100000000006,null,"2012 04 30 23",95410.8,null,"2012 04 30 23",88344.5,null,"2012 04 30 23",98795.4,null,"2012 04 30 23",95223.5,null,"2012 04 30 23",105902.1,null,"2012 04 30 23",96196.1,null,"2012 04 30 23",90492.2,null,"2012 04 30 23",73450,null,"2012 04 30 23",87857.2,null,"2012 04 30 23",109507,null,"2012 04 30 23",90409,null,"2012 04 30 23",90478.6,null,"2012 04 30 23",109322.3,null,"2012 04 30 23",105207.1,null,"2012 04 30 23",104550.6,null,"2012 04 30 23",76263.8,null,"2012 04 30 23",89771]
["2012 05 31 23",141072.79999999999,null,"2012 05 31 23",149341.5,null,"2012 05 31 23",147326.39999999999,null,"2012 05 31 23",157888.6,null,"2012 05 31 23",170431,null,"2012 05 31 23",171989.2,null,"2012 05 31 23",183617.8,null,"2012 05 31 23",184906.7,null,"2012 05 31 23",149500.79999999999,null,"2012 05 31 23",153317.20000000001,null,"2012 05 31 23",121121.9,null,"2012 05 31 23",134173.6,null,"2012 05 31 23",186776.3,null,"2012 05 31 23",161919.1,null,"2012 05 31 23",166838.1,null,"2012 05 31 23",173914.3,null,"2012 05 31 23",192898.3,null,"2012 05 31 23",185015.3,null,"2012 05 31 23",104653,null,"2012 05 31 23",129921.8]
["2012 06 30 23",111158,null,"2012 06 30 23",142719.1,null,"2012 06 30 23",108826.2,null,"2012 06 30 23",148789.1,null,"2012 06 30 23",134955.6,null,"2012 06 30 23",165967.1,null,"2012 06 30 23",145945,null,"2012 06 30 23",181465.1,null,"2012 06 30 23",82625.100000000006,null,"2012 06 30 23",130752.1,null,"2012 06 30 23",102598.2,null,"2012 06 30 23",141787.5,null,"2012 06 30 23",123659.4,null,"2012 06 30 23",152401.29999999999,null,"2012 06 30 23",128030,null,"2012 06 30 23",163259.79999999999,null,"2012 06 30 23",144037.70000000001,null,"2012 06 30 23",163217,null,"2012 06 30 23",113095.4,null,"2012 06 30 23",149327.4]
["2012 07 31 23",112223.8,null,"2012 07 31 23",140605.5,null,"2012 07 31 23",115707.6,null,"2012 07 31 23",151700.4,null,"2012 07 31 23",132378.1,null,"2012 07 31 23",158894.9,null,"2012 07 31 23",138907.70000000001,null,"2012 07 31 23",166512.6,null,"2012 07 31 23",121972.8,null,"2012 07 31 23",141105.60000000001,null,"2012 07 31 23",91714.5,null,"2012 07 31 23",134065.4,null,"2012 07 31 23",169064.5,null,"2012 07 31 23",163904.79999999999,null,"2012 07 31 23",141480.79999999999,null,"2012 07 31 23",165286,null,"2012 07 31 23",150705.70000000001,null,"2012 07 31 23",169353.8,null,"2012 07 31 23",77704.399999999994,null,"2012 07 31 23",128096.1]
["2012 08 31 23",77513.7,null,"2012 08 31 23",106563.5,null,"2012 08 31 23",108844,null,"2012 08 31 23",126361.4,null,"2012 08 31 23",115569.8,null,"2012 08 31 23",129098.8,null,"2012 08 31 23",101645,null,"2012 08 31 23",133148.1,null,"2012 08 31 23",99341.8,null,"2012 08 31 23",104097.8,null,"2012 08 31 23",67874.100000000006,null,"2012 08 31 23",100635.5,null,"2012 08 31 23",145038.6,null,"2012 08 31 23",126730.5,null,"2012 08 31 23",120185.9,null,"2012 08 31 23",141721.1,null,"2012 08 31 23",115475.1,null,"2012 08 31 23",133264.6,null,"2012 08 31 23",75568.2,null,"2012 08 31 23",102137.2]
["2012 09 30 23",80068.7,null,"2012 09 30 23",69290.3,null,"2012 09 30 23",57041,null,"2012 09 30 23",72830.100000000006,null,"2012 09 30 23",70638.100000000006,null,"2012 09 30 23",77001.8,null,"2012 09 30 23",79001.600000000006,null,"2012 09 30 23",84888.9,null,"2012 09 30 23",64181.599999999999,null,"2012 09 30 23",54694.8,null,"2012 09 30 23",72432.3,null,"2012 09 30 23",67672.800000000003,null,"2012 09 30 23",75944.2,null,"2012 09 30 23",59407,null,"2012 09 30 23",74114.2,null,"2012 09 30 23",86410.9,null,"2012 09 30 23",95790.8,null,"2012 09 30 23",83429.100000000006,null,"2012 09 30 23",52034.1,null,"2012 09 30 23",61773]
["2012 10 31 23",34138.6,null,"2012 10 31 23",30933.9,null,"2012 10 31 23",49186.5,null,"2012 10 31 23",39873.1,null,"2012 10 31 23",54802.400000000001,null,"2012 10 31 23",41401.599999999999,null,"2012 10 31 23",59276.3,null,"2012 10 31 23",48700.7,null,"2012 10 31 23",35007.599999999999,null,"2012 10 31 23",17359.8,null,"2012 10 31 23",28482.6,null,"2012 10 31 23",27384.1,null,"2012 10 31 23",37764.199999999997,null,"2012 10 31 23",19926.8,null,"2012 10 31 23",53039.9,null,"2012 10 31 23",48561.9,null,"2012 10 31 23",60129.3,null,"2012 10 31 23",41341.199999999997,null,"2012 10 31 23",22942.5,null,"2012 10 31 23",23988.7]
["2012 11 30 23",23182.2,null,"2012 11 30 23",10684.7,null,"2012 11 30 23",10557.8,null,"2012 11 30 23",12535.2,null,"2012 11 30 23",13902.4,null,"2012 11 30 23",13637.3,null,"2012 11 30 23",17908,null,"2012 11 30 23",15168,null,"2012 11 30 23",5296.7,null,"2012 11 30 23",2289.1,null,"2012 11 30 23",19245.099999999999,null,"2012 11 30 23",9229.9,null,"2012 11 30 23",12173.9,null,"2012 11 30 23",4048.7,null,"2012 11 30 23",17987.400000000001,null,"2012 11 30 23",17035,null,"2012 11 30 23",24577.3,null,"2012 11 30 23",12785.8,null,"2012 11 30 23",12692.2,null,"2012 11 30 23",7330]
["2012 12 31 23",10373.4,null,"2012 12 31 23",3868.9,null,"2012 12 31 23",18247.099999999999,null,"2012 12 31 23",8276.2000000000007,null,"2012 12 31 23",10854.2,null,"2012 12 31 23",7346.4,null,"2012 12 31 23",13405.9,null,"2012 12 31 23",7966.2,null,"2012 12 31 23",155.69999999999999,null,"2012 12 31 23",54.3,null,"2012 12 31 23",8247.7999999999993,null,"2012 12 31 23",3140,null,"2012 12 31 23",757.8,null,"2012 12 31 23",485.2,null,"2012 12 31 23",9098.9,null,"2012 12 31 23",9434.7999999999993,null,"2012 12 31 23",7629.8,null,"2012 12 31 23",5028.1000000000004,null,"2012 12 31 23",3878.5,null,"2012 12 31 23",2000.2]
["2013 01 31 23",24641.3,null,"2013 01 31 23",8619.1,null,"2013 01 31 23",17155.7,null,"2013 01 31 23",11453.6,null,"2013 01 31 23",10671.2,null,"2013 01 31 23",10894.7,null,"2013 01 31 23",10028.700000000001,null,"2013 01 31 23",11705.1,null,"2013 01 31 23",7004.2,null,"2013 01 31 23",1309.4000000000001,null,"2013 01 31 23",25172.9,null,"2013 01 31 23",8323,null,"2013 01 31 23",15604.6,null,"2013 01 31 23",2958.7,null,"2013 01 31 23",21235.3,null,"2013 01 31 23",16457.5,null,"2013 01 31 23",20713.099999999999,null,"2013 01 31 23",9488.7999999999993,null,"2013 01 31 23",11246.3,null,"2013 01 31 23",5460.8]
["2013 02 28 23",22091.5,null,"2013 02 28 23",17458.099999999999,null,"2013 02 28 23",22149,null,"2013 02 28 23",25035.8,null,"2013 02 28 23",17535.5,null,"2013 02 28 23",23439.599999999999,null,"2013 02 28 23",18918.599999999999,null,"2013 02 28 23",23251.599999999999,null,"2013 02 28 23",18365.099999999999,null,"2013 02 28 23",11199.7,null,"2013 02 28 23",23069.7,null,"2013 02 28 23",17418.099999999999,null,"2013 02 28 23",32655.200000000001,null,"2013 02 28 23",16722.7,null,"2013 02 28 23",10020.1,null,"2013 02 28 23",22966.799999999999,null,"2013 02 28 23",27799.1,null,"2013 02 28 23",21540.1,null,"2013 02 28 23",12493.5,null,"2013 02 28 23",15095.9]
["2013 03 31 23",164739.5,null,"2013 03 31 23",90399.3,null,"2013 03 31 23",128868.5,null,"2013 03 31 23",90339.6,null,"2013 03 31 23",122341.2,null,"2013 03 31 23",88246,null,"2013 03 31 23",109615.3,null,"2013 03 31 23",89048,null,"2013 03 31 23",73832.399999999994,null,"2013 03 31 23",54776.3,null,"2013 03 31 23",145681.79999999999,null,"2013 03 31 23",82066.399999999994,null,"2013 03 31 23",146429,null,"2013 03 31 23",74437.100000000006,null,"2013 03 31 23",112394.1,null,"2013 03 31 23",91538.5,null,"2013 03 31 23",157188.5,null,"2013 03 31 23",95207.7,null,"2013 03 31 23",135858.29999999999,null,"2013 03 31 23",77098.600000000006]
["2013 04 30 23",133207.9,null,"2013 04 30 23",114726,null,"2013 04 30 23",138907.1,null,"2013 04 30 23",123886.8,null,"2013 04 30 23",150625,null,"2013 04 30 23",128642.4,null,"2013 04 30 23",142660.20000000001,null,"2013 04 30 23",134185.4,null,"2013 04 30 23",93396.2,null,"2013 04 30 23",91955.1,null,"2013 04 30 23",109001,null,"2013 04 30 23",106046.6,null,"2013 04 30 23",137771.29999999999,null,"2013 04 30 23",105878.3,null,"2013 04 30 23",134496.70000000001,null,"2013 04 30 23",132510.5,null,"2013 04 30 23",156570.9,null,"2013 04 30 23",125333.3,null,"2013 04 30 23",104546.1,null,"2013 04 30 23",106788.6]
["2013 05 31 23",151841.9,null,"2013 05 31 23",154870.9,null,"2013 05 31 23",135458.1,null,"2013 05 31 23",158030.5,null,"2013 05 31 23",147510.20000000001,null,"2013 05 31 23",157596.20000000001,null,"2013 05 31 23",181671.4,null,"2013 05 31 23",171754.8,null,"2013 05 31 23",152651.9,null,"2013 05 31 23",144289.79999999999,null,"2013 05 31 23",130872.9,null,"2013 05 31 23",144136,null,"2013 05 31 23",208281.1,null,"2013 05 31 23",166230.5,null,"2013 05 31 23",177771,null,"2013 05 31 23",174580.6,null,"2013 05 31 23",188827.1,null,"2013 05 31 23",172843.7,null,"2013 05 31 23",138732.4,null,"2013 05 31 23",148331.79999999999]
["2013 06 30 23",120330.1,null,"2013 06 30 23",152767.4,null,"2013 06 30 23",137294.29999999999,null,"2013 06 30 23",160827.29999999999,null,"2013 06 30 23",141591.5,null,"2013 06 30 23",162403.20000000001,null,"2013 06 30 23",169191,null,"2013 06 30 23",177554.5,null,"2013 06 30 23",78401.5,null,"2013 06 30 23",119899.8,null,"2013 06 30 23",89804.800000000003,null,"2013 06 30 23",135649.79999999999,null,"2013 06 30 23",160879.4,null,"2013 06 30 23",162418.29999999999,null,"2013 06 30 23",172672.6,null,"2013 06 30 23",177987,null,"2013 06 30 23",188691.5,null,"2013 06 30 23",185070.1,null,"2013 06 30 23",105276.2,null,"2013 06 30 23",139927.70000000001]
["2013 07 31 23",172160,null,"2013 07 31 23",170931.9,null,"2013 07 31 23",177996.79999999999,null,"2013 07 31 23",178072.5,null,"2013 07 31 23",174850.3,null,"2013 07 31 23",175578.9,null,"2013 07 31 23",165687.1,null,"2013 07 31 23",177256.3,null,"2013 07 31 23",117224.4,null,"2013 07 31 23",136944.1,null,"2013 07 31 23",136897.60000000001,null,"2013 07 31 23",152522.79999999999,null,"2013 07 31 23",172079.8,null,"2013 07 31 23",166033.4,null,"2013 07 31 23",183258.6,null,"2013 07 31 23",187465.4,null,"2013 07 31 23",202552.2,null,"2013 07 31 23",186488.9,null,"2013 07 31 23",96004.4,null,"2013 07 31 23",134336.1]
["2013 08 31 23",151100,null,"2013 08 31 23",130644.2,null,"2013 08 31 23",105946.3,null,"2013 08 31 23",124993.7,null,"2013 08 31 23",127947.8,null,"2013 08 31 23",131792.70000000001,null,"2013 08 31 23",136291.1,null,"2013 08 31 23",145998.6,null,"2013 08 31 23",90967.5,null,"2013 08 31 23",103255.2,null,"2013 08 31 23",103437.1,null,"2013 08 31 23",108706.8,null,"2013 08 31 23",160416.1,null,"2013 08 31 23",128099,null,"2013 08 31 23",133352.70000000001,null,"2013 08 31 23",141966.9,null,"2013 08 31 23",176030.4,null,"2013 08 31 23",153276.4,null,"2013 08 31 23",98824.3,null,"2013 08 31 23",110251.2]
["2013 09 30 23",100034.9,null,"2013 09 30 23",81718.7,null,"2013 09 30 23",84154,null,"2013 09 30 23",83134.399999999994,null,"2013 09 30 23",96380.6,null,"2013 09 30 23",89790.6,null,"2013 09 30 23",111256.7,null,"2013 09 30 23",95382.5,null,"2013 09 30 23",34010.300000000003,null,"2013 09 30 23",43792.9,null,"2013 09 30 23",60356.6,null,"2013 09 30 23",66545.5,null,"2013 09 30 23",56137.3,null,"2013 09 30 23",55619,null,"2013 09 30 23",107961.9,null,"2013 09 30 23",92151.5,null,"2013 09 30 23",127912,null,"2013 09 30 23",96968.2,null,"2013 09 30 23",57865.7,null,"2013 09 30 23",63188.6]
["2013 10 31 23",72074.5,null,"2013 10 31 23",39929.699999999997,null,"2013 10 31 23",38264.5,null,"2013 10 31 23",35428.1,null,"2013 10 31 23",48306.1,null,"2013 10 31 23",40579,null,"2013 10 31 23",38575.4,null,"2013 10 31 23",41148.1,null,"2013 10 31 23",32103.200000000001,null,"2013 10 31 23",20652.2,null,"2013 10 31 23",64373.3,null,"2013 10 31 23",36277.599999999999,null,"2013 10 31 23",56926.3,null,"2013 10 31 23",28607.8,null,"2013 10 31 23",42563.8,null,"2013 10 31 23",44027,null,"2013 10 31 23",62348.6,null,"2013 10 31 23",41368.199999999997,null,"2013 10 31 23",44596.6,null,"2013 10 31 23",31217.9]
["2013 11 30 23",29972.9,null,"2013 11 30 23",11934.3,null,"2013 11 30 23",30217.8,null,"2013 11 30 23",16862,null,"2013 11 30 23",30202.6,null,"2013 11 30 23",16297.7,null,"2013 11 30 23",35665.5,null,"2013 11 30 23",18688.8,null,"2013 11 30 23",7909.6,null,"2013 11 30 23",2507.6999999999998,null,"2013 11 30 23",23310.400000000001,null,"2013 11 30 23",9861.4,null,"2013 11 30 23",18150.099999999999,null,"2013 11 30 23",4971.8,null,"2013 11 30 23",33005.800000000003,null,"2013 11 30 23",18113.099999999999,null,"2013 11 30 23",35264.9,null,"2013 11 30 23",15687.8,null,"2013 11 30 23",12383.4,null,"2013 11 30 23",7174.8]
["2013 12 31 23",16686.400000000001,null,"2013 12 31 23",4901.3999999999996,null,"2013 12 31 23",12299.9,null,"2013 12 31 23",7331.9,null,"2013 12 31 23",14869.5,null,"2013 12 31 23",7688.3,null,"2013 12 31 23",17388.3,null,"2013 12 31 23",9197.9,null,"2013 12 31 23",610.4,null,"2013 12 31 23",115.3,null,"2013 12 31 23",10970.2,null,"2013 12 31 23",3397.8,null,"2013 12 31 23",6992.2,null,"2013 12 31 23",859.5,null,"2013 12 31 23",8796.7999999999993,null,"2013 12 31 23",8714.4,null,"2013 12 31 23",18227,null,"2013 12 31 23",6705.9,null,"2013 12 31 23",5112.3999999999996,null,"2013 12 31 23",2128.1]
["2014 01 31 23",4232.5,null,"2014 01 31 23",6100.4,null,"2014 01 31 23",9286.2000000000007,null,"2014 01 31 23",10559.2,null,"2014 01 31 23",6615.6,null,"2014 01 31 23",9864.7999999999993,null,"2014 01 31 23",7033.1,null,"2014 01 31 23",9973.1,null,"2014 01 31 23",3449.1,null,"2014 01 31 23",1234.4000000000001,null,"2014 01 31 23",4355.8999999999996,null,"2014 01 31 23",4892.6000000000004,null,"2014 01 31 23",11390.4,null,"2014 01 31 23",3009.8,null,"2014 01 31 23",3644.9,null,"2014 01 31 23",10008.299999999999,null,"2014 01 31 23",12763.5,null,"2014 01 31 23",9367.1,null,"2014 01 31 23",7957.1,null,"2014 01 31 23",4658.8999999999996]
["2014 02 28 23",12591.1,null,"2014 02 28 23",13335.5,null,"2014 02 28 23",12830.4,null,"2014 02 28 23",20335.099999999999,null,"2014 02 28 23",8811,null,"2014 02 28 23",17364.900000000001,null,"2014 02 28 23",19121.3,null,"2014 02 28 23",23705.7,null,"2014 02 28 23",6120.5,null,"2014 02 28 23",6916.5,null,"2014 02 28 23",5891.7,null,"2014 02 28 23",11802.1,null,"2014 02 28 23",5207.2,null,"2014 02 28 23",7455.5,null,"2014 02 28 23",27354,null,"2014 02 28 23",31088.7,null,"2014 02 28 23",14389.3,null,"2014 02 28 23",16474.099999999999,null,"2014 02 28 23",14417.2,null,"2014 02 28 23",14837.9]
["2014 03 31 23",104960.6,null,"2014 03 31 23",71987.8,null,"2014 03 31 23",82350.2,null,"2014 03 31 23",71513.899999999994,null,"2014 03 31 23",85717.5,null,"2014 03 31 23",73607.399999999994,null,"2014 03 31 23",86482.7,null,"2014 03 31 23",79469.100000000006,null,"2014 03 31 23",55442.400000000001,null,"2014 03 31 23",46195,null,"2014 03 31 23",85344.2,null,"2014 03 31 23",62955.9,null,"2014 03 31 23",83282.3,null,"2014 03 31 23",58642.3,null,"2014 03 31 23",90876.9,null,"2014 03 31 23",79560.7,null,"2014 03 31 23",51299.8,null,"2014 03 31 23",62777.4,null,"2014 03 31 23",64161.7,null,"2014 03 31 23",58153]
["2014 04 30 23",156272.5,null,"2014 04 30 23",125637.3,null,"2014 04 30 23",114208.5,null,"2014 04 30 23",111761.4,null,"2014 04 30 23",136374.70000000001,null,"2014 04 30 23",124151.3,null,"2014 04 30 23",141896.6,null,"2014 04 30 23",129215.3,null,"2014 04 30 23",105287.6,null,"2014 04 30 23",98168.6,null,"2014 04 30 23",111218.9,null,"2014 04 30 23",109562.8,null,"2014 04 30 23",122703.7,null,"2014 04 30 23",110563.5,null,"2014 04 30 23",115892.3,null,"2014 04 30 23",120972.1,null,"2014 04 30 23",59350.2,null,"2014 04 30 23",97353.3,null,"2014 04 30 23",105534,null,"2014 04 30 23",102879.8]
["2014 05 31 23",139590.1,null,"2014 05 31 23",146892.29999999999,null,"2014 05 31 23",159330.79999999999,null,"2014 05 31 23",161497.29999999999,null,"2014 05 31 23",150565,null,"2014 05 31 23",156608.6,null,"2014 05 31 23",150837.1,null,"2014 05 31 23",164992.70000000001,null,"2014 05 31 23",101439.9,null,"2014 05 31 23",125314.8,null,"2014 05 31 23",102962.1,null,"2014 05 31 23",128340.2,null,"2014 05 31 23",140231.4,null,"2014 05 31 23",149232.6,null,"2014 05 31 23",144669.20000000001,null,"2014 05 31 23",157919.20000000001,null,"2014 05 31 23",63998.9,null,"2014 05 31 23",124647.8,null,"2014 05 31 23",103948.5,null,"2014 05 31 23",126982.1]
["2014 06 30 23",113235.2,null,"2014 06 30 23",144389,null,"2014 06 30 23",149521,null,"2014 06 30 23",172807.1,null,"2014 06 30 23",159345.60000000001,null,"2014 06 30 23",174194.1,null,"2014 06 30 23",144936.70000000001,null,"2014 06 30 23",171647,null,"2014 06 30 23",91594.4,null,"2014 06 30 23",133048.5,null,"2014 06 30 23",94157.4,null,"2014 06 30 23",131887.79999999999,null,"2014 06 30 23",165542.39999999999,null,"2014 06 30 23",174112.8,null,"2014 06 30 23",157868,null,"2014 06 30 23",179287,null,"2014 06 30 23",93174,null,"2014 06 30 23",148301.70000000001,null,"2014 06 30 23",100243.6,null,"2014 06 30 23",139090.79999999999]
["2014 07 31 23",216233.1,null,"2014 07 31 23",189073.7,null,"2014 07 31 23",192130.1,null,"2014 07 31 23",187401,null,"2014 07 31 23",209276.2,null,"2014 07 31 23",188629.6,null,"2014 07 31 23",194465.3,null,"2014 07 31 23",184579.6,null,"2014 07 31 23",150937.4,null,"2014 07 31 23",149704.20000000001,null,"2014 07 31 23",178264.2,null,"2014 07 31 23",169769.2,null,"2014 07 31 23",234700.9,null,"2014 07 31 23",186986.8,null,"2014 07 31 23",209882.9,null,"2014 07 31 23",196444.1,null,"2014 07 31 23",186186.5,null,"2014 07 31 23",184817.7,null,"2014 07 31 23",189292.3,null,"2014 07 31 23",171019.4]
["2014 08 31 23",112661.8,null,"2014 08 31 23",122371.2,null,"2014 08 31 23",105721.4,null,"2014 08 31 23",126988.6,null,"2014 08 31 23",111973.8,null,"2014 08 31 23",122804.7,null,"2014 08 31 23",122857.1,null,"2014 08 31 23",136465.9,null,"2014 08 31 23",84584.1,null,"2014 08 31 23",95754.7,null,"2014 08 31 23",82924.2,null,"2014 08 31 23",106083.5,null,"2014 08 31 23",130795.4,null,"2014 08 31 23",116447.7,null,"2014 08 31 23",117409,null,"2014 08 31 23",134803.20000000001,null,"2014 08 31 23",112464.8,null,"2014 08 31 23",127449.60000000001,null,"2014 08 31 23",85066.1,null,"2014 08 31 23",104744.8]
["2014 09 30 23",138398,null,"2014 09 30 23",92695.5,null,"2014 09 30 23",125806,null,"2014 09 30 23",99093.8,null,"2014 09 30 23",114175.6,null,"2014 09 30 23",90972.6,null,"2014 09 30 23",121322.1,null,"2014 09 30 23",97036.9,null,"2014 09 30 23",50340.800000000003,null,"2014 09 30 23",53793.5,null,"2014 09 30 23",125394.9,null,"2014 09 30 23",85712.4,null,"2014 09 30 23",116672.5,null,"2014 09 30 23",77166.8,null,"2014 09 30 23",111504.6,null,"2014 09 30 23",97459,null,"2014 09 30 23",127841.4,null,"2014 09 30 23",93150.1,null,"2014 09 30 23",70805.399999999994,null,"2014 09 30 23",66418.3]
["2014 10 31 23",27033.5,null,"2014 10 31 23",24810.400000000001,null,"2014 10 31 23",32574,null,"2014 10 31 23",35896.9,null,"2014 10 31 23",37272.6,null,"2014 10 31 23",38092.699999999997,null,"2014 10 31 23",34881,null,"2014 10 31 23",38202.6,null,"2014 10 31 23",18123.3,null,"2014 10 31 23",15866.8,null,"2014 10 31 23",25996.9,null,"2014 10 31 23",21540.400000000001,null,"2014 10 31 23",38417.9,null,"2014 10 31 23",20671.400000000001,null,"2014 10 31 23",39955,null,"2014 10 31 23",40212.9,null,"2014 10 31 23",23731.5,null,"2014 10 31 23",27474.400000000001,null,"2014 10 31 23",21795.599999999999,null,"2014 10 31 23",20571.8]
["2014 11 30 23",8509.4,null,"2014 11 30 23",7304.8,null,"2014 11 30 23",13297.6,null,"2014 11 30 23",12673.1,null,"2014 11 30 23",10399,null,"2014 11 30 23",11198.2,null,"2014 11 30 23",13447.2,null,"2014 11 30 23",11535.3,null,"2014 11 30 23",9568.1,null,"2014 11 30 23",3411.1,null,"2014 11 30 23",10506.3,null,"2014 11 30 23",6564.1,null,"2014 11 30 23",18933.7,null,"2014 11 30 23",5189.3,null,"2014 11 30 23",12839.8,null,"2014 11 30 23",15152.4,null,"2014 11 30 23",2994.2,null,"2014 11 30 23",7198.1,null,"2014 11 30 23",10673.2,null,"2014 11 30 23",6293.3]
["2014 12 31 23",22801.5,null,"2014 12 31 23",5716.6,null,"2014 12 31 23",17035.400000000001,null,"2014 12 31 23",8995.9,null,"2014 12 31 23",10670.9,null,"2014 12 31 23",7557.9,null,"2014 12 31 23",21658.400000000001,null,"2014 12 31 23",10525.9,null,"2014 12 31 23",664,null,"2014 12 31 23",89,null,"2014 12 31 23",14864.9,null,"2014 12 31 23",3724.6,null,"2014 12 31 23",4513.2,null,"2014 12 31 23",773.1,null,"2014 12 31 23",12595.9,null,"2014 12 31 23",9512.7999999999993,null,"2014 12 31 23",21186,null,"2014 12 31 23",6774.4,null,"2014 12 31 23",8688.5,null,"2014 12 31 23",2466.4]
["2015 01 31 23",19921,null,"2015 01 31 23",7062.2,null,"2015 01 31 23",13894.8,null,"2015 01 31 23",10060.5,null,"2015 01 31 23",9121.9,null,"2015 01 31 23",9001.2999999999993,null,"2015 01 31 23",23217.5,null,"2015 01 31 23",12244.5,null,"2015 01 31 23",2875.3,null,"2015 01 31 23",900.7,null,"2015 01 31 23",15243,null,"2015 01 31 23",5435.1,null,"2015 01 31 23",7522,null,"2015 01 31 23",1954.1,null,"2015 01 31 23",13349,null,"2015 01 31 23",12188.3,null,"2015 01 31 23",9548.7000000000007,null,"2015 01 31 23",6601.7,null,"2015 01 31 23",7751,null,"2015 01 31 23",4335.1000000000004]
["2015 02 28 23",28628,null,"2015 02 28 23",20702.7,null,"2015 02 28 23",10714.9,null,"2015 02 28 23",18285,null,"2015 02 28 23",22264.5,null,"2015 02 28 23",23255.200000000001,null,"2015 02 28 23",26134.799999999999,null,"2015 02 28 23",24376.5,null,"2015 02 28 23",23205,null,"2015 02 28 23",11344.5,null,"2015 02 28 23",21829.3,null,"2015 02 28 23",19203.3,null,"2015 02 28 23",31962.7,null,"2015 02 28 23",13673.6,null,"2015 02 28 23",25115.200000000001,null,"2015 02 28 23",26754,null,"2015 02 28 23",30145.9,null,"2015 02 28 23",22335,null,"2015 02 28 23",22812.9,null,"2015 02 28 23",18064.7]
["2015 03 31 23",101808.5,null,"2015 03 31 23",64031.3,null,"2015 03 31 23",75879.3,null,"2015 03 31 23",65739.100000000006,null,"2015 03 31 23",91286.1,null,"2015 03 31 23",74200.899999999994,null,"2015 03 31 23",93138.2,null,"2015 03 31 23",76097.600000000006,null,"2015 03 31 23",64746.8,null,"2015 03 31 23",46742.8,null,"2015 03 31 23",104851.5,null,"2015 03 31 23",64160.3,null,"2015 03 31 23",99475.3,null,"2015 03 31 23",53154.7,null,"2015 03 31 23",71931.600000000006,null,"2015 03 31 23",67678.5,null,"2015 03 31 23",98874.8,null,"2015 03 31 23",66375.899999999994,null,"2015 03 31 23",96233.1,null,"2015 03 31 23",62508.4]
["2015 04 30 23",115637.1,null,"2015 04 30 23",118258.5,null,"2015 04 30 23",146746.70000000001,null,"2015 04 30 23",127247.2,null,"2015 04 30 23",140946,null,"2015 04 30 23",131513.79999999999,null,"2015 04 30 23",133333.9,null,"2015 04 30 23",132269,null,"2015 04 30 23",64288.4,null,"2015 04 30 23",81324.2,null,"2015 04 30 23",94417,null,"2015 04 30 23",104827.8,null,"2015 04 30 23",115601.7,null,"2015 04 30 23",101876.8,null,"2015 04 30 23",111403,null,"2015 04 30 23",115353.1,null,"2015 04 30 23",124011.1,null,"2015 04 30 23",120695.4,null,"2015 04 30 23",72489.5,null,"2015 04 30 23",93339.4]
["2015 05 31 23",77198.8,null,"2015 05 31 23",121392.2,null,"2015 05 31 23",104554.4,null,"2015 05 31 23",134586.29999999999,null,"2015 05 31 23",110100.7,null,"2015 05 31 23",146335.5,null,"2015 05 31 23",152524.79999999999,null,"2015 05 31 23",167162.20000000001,null,"2015 05 31 23",72959.600000000006,null,"2015 05 31 23",107766.7,null,"2015 05 31 23",62522.7,null,"2015 05 31 23",109663.7,null,"2015 05 31 23",96037.7,null,"2015 05 31 23",117766.1,null,"2015 05 31 23",115004.9,null,"2015 05 31 23",134450.6,null,"2015 05 31 23",109973.9,null,"2015 05 31 23",134811,null,"2015 05 31 23",67468,null,"2015 05 31 23",114125]
["2015 06 30 23",100089.8,null,"2015 06 30 23",144104.9,null,"2015 06 30 23",134716.1,null,"2015 06 30 23",163973.1,null,"2015 06 30 23",137661.5,null,"2015 06 30 23",168311.5,null,"2015 06 30 23",170498.8,null,"2015 06 30 23",187051.2,null,"2015 06 30 23",96707.5,null,"2015 06 30 23",139781.5,null,"2015 06 30 23",82858.899999999994,null,"2015 06 30 23",137558.79999999999,null,"2015 06 30 23",154936,null,"2015 06 30 23",164910.79999999999,null,"2015 06 30 23",105019.3,null,"2015 06 30 23",131884,null,"2015 06 30 23",139128.70000000001,null,"2015 06 30 23",165891.70000000001,null,"2015 06 30 23",89830.2,null,"2015 06 30 23",137505.4]
["2015 07 31 23",108102.3,null,"2015 07 31 23",139905,null,"2015 07 31 23",126976.2,null,"2015 07 31 23",155259.70000000001,null,"2015 07 31 23",129184.7,null,"2015 07 31 23",155440.6,null,"2015 07 31 23",145890.29999999999,null,"2015 07 31 23",168378,null,"2015 07 31 23",68321.600000000006,null,"2015 07 31 23",111694.7,null,"2015 07 31 23",79304.600000000006,null,"2015 07 31 23",123917.7,null,"2015 07 31 23",131187.29999999999,null,"2015 07 31 23",146160.4,null,"2015 07 31 23",128169,null,"2015 07 31 23",142387.79999999999,null,"2015 07 31 23",106090.8,null,"2015 07 31 23",143783.1,null,"2015 07 31 23",84856.6,null,"2015 07 31 23",127283.3]
["2015 08 31 23",190368.1,null,"2015 08 31 23",150462.20000000001,null,"2015 08 31 23",147205.6,null,"2015 08 31 23",140874.6,null,"2015 08 31 23",174591.4,null,"2015 08 31 23",155412.5,null,"2015 08 31 23",162519,null,"2015 08 31 23",157883.4,null,"2015 08 31 23",121365.4,null,"2015 08 31 23",101420.1,null,"2015 08 31 23",154202,null,"2015 08 31 23",133525.5,null,"2015 08 31 23",174392.1,null,"2015 08 31 23",133664.20000000001,null,"2015 08 31 23",176319.4,null,"2015 08 31 23",145599,null,"2015 08 31 23",200977.2,null,"2015 08 31 23",161885.5,null,"2015 08 31 23",138239.70000000001,null,"2015 08 31 23",122318.5]
["2015 09 30 23",69658.899999999994,null,"2015 09 30 23",67144,null,"2015 09 30 23",87222.9,null,"2015 09 30 23",86045.4,null,"2015 09 30 23",90646.6,null,"2015 09 30 23",85872.6,null,"2015 09 30 23",99976.2,null,"2015 09 30 23",93100.2,null,"2015 09 30 23",64305.2,null,"2015 09 30 23",51541.2,null,"2015 09 30 23",50720.7,null,"2015 09 30 23",55298.1,null,"2015 09 30 23",99528.4,null,"2015 09 30 23",67386.7,null,"2015 09 30 23",80447.600000000006,null,"2015 09 30 23",82593.899999999994,null,"2015 09 30 23",83829,null,"2015 09 30 23",77061.8,null,"2015 09 30 23",54795.199999999997,null,"2015 09 30 23",61044]
["2015 10 31 23",80109.7,null,"2015 10 31 23",45632.7,null,"2015 10 31 23",46729.1,null,"2015 10 31 23",45201,null,"2015 10 31 23",52673.599999999999,null,"2015 10 31 23",46819.3,null,"2015 10 31 23",38073.4,null,"2015 10 31 23",43542.5,null,"2015 10 31 23",35957.300000000003,null,"2015 10 31 23",21764.400000000001,null,"2015 10 31 23",63287.8,null,"2015 10 31 23",37449.199999999997,null,"2015 10 31 23",78448.3,null,"2015 10 31 23",35096.1,null,"2015 10 31 23",30388.799999999999,null,"2015 10 31 23",40038.5,null,"2015 10 31 23",74363.199999999997,null,"2015 10 31 23",45141.1,null,"2015 10 31 23",36987.9,null,"2015 10 31 23",30601.3]
["2015 11 30 23",29709.200000000001,null,"2015 11 30 23",12528.2,null,"2015 11 30 23",16944.2,null,"2015 11 30 23",13466.2,null,"2015 11 30 23",17074.8,null,"2015 11 30 23",15179.3,null,"2015 11 30 23",29340,null,"2015 11 30 23",19171.8,null,"2015 11 30 23",5598.5,null,"2015 11 30 23",2294.6999999999998,null,"2015 11 30 23",26503.3,null,"2015 11 30 23",10846.1,null,"2015 11 30 23",11408.4,null,"2015 11 30 23",4007.2,null,"2015 11 30 23",13519.8,null,"2015 11 30 23",13815.5,null,"2015 11 30 23",23383.7,null,"2015 11 30 23",11522.2,null,"2015 11 30 23",16619.599999999999,null,"2015 11 30 23",8257.7000000000007]
["2015 12 31 23",27638.1,null,"2015 12 31 23",6510.2,null,"2015 12 31 23",16348.8,null,"2015 12 31 23",8458.7999999999993,null,"2015 12 31 23",14068.1,null,"2015 12 31 23",8478.7000000000007,null,"2015 12 31 23",27439,null,"2015 12 31 23",11374.9,null,"2015 12 31 23",1051.0999999999999,null,"2015 12 31 23",120.5,null,"2015 12 31 23",16481,null,"2015 12 31 23",4482.8999999999996,null,"2015 12 31 23",8337,null,"2015 12 31 23",962.6,null,"2015 12 31 23",14656.9,null,"2015 12 31 23",9951.7999999999993,null,"2015 12 31 23",25263.7,null,"2015 12 31 23",7681.7,null,"2015 12 31 23",7906.6,null,"2015 12 31 23",2733.1]

{"sheet":"Ändringar","index":12,"n_rows":10,"n_cols":4,"rows_kept":10,"cut":false,"hidden":true,"merged":[]}
["Datum","Flik","Cell","Kommentar"]
[141216,"Instruktion",null,"Kompletterat instruktionen"]
[150124,"0rt","B133:Y286","Ändrat resultatrutornas färg till grön och dragit alla rutor."]
[150124,"0rt",null,"Lagt till ruta med beskrivning av beräkningen"]
[150401,"Lutande yta",null,"Horisontavskärmning för kardinalväderstrecken infört"]
[150722,"Lutande yta","Markreflektion","Ändrat från beroende av difsusstrålningen till beroende av globalstrålningen"]
[150814,"Lutande yta","Horisontavskärmning","Öster och väster var fel"]
[150815,"Lutande yta","Himmelsstrålning","Ändrat från isotrop till pseudoisotrop"]
[160106,"Instruktion",null,"Komplettering i beskrivning"]
[170119,null,null,"Flera redaktionella ämndringar"]